{"text_format":"1","workbook":"xlsx","n_sheets":34,"sheets":["Attente","Langue","Dictionnaire","Menu principal","Instructions","Paramètres","Remerciements","Menu simulation","Questionnaire","Bilan des calculs","Graphique coûts-revenus","Graphique marge actualisée","Bilan-Carbone","Compilation","Devis d'implantation des écrans","Coûts d'implantation","Calcul espace cultivable","Entretien des écrans boisés","Calcul d'économie de chauffage","Calcul d'économie déneigement","Calcul du rendement en bois","Calcul du rendement en petits f","Amélioration de rendement","Pertes de sol","Crédits carbone","tableau synthèse","Administrateurs","Modèles de haies","Références espace cultivable","Référence déneigement","Questionnaire saule","Calculs saule","Coûts référence","Bilan des calculs saule"],"not_rendered":{"charts":8,"images":492,"macros":1,"external_links":4,"defined_names":196,"comments":12,"pivot_tables":0},"unopened":[],"bounds":{"document_bytes":16777216,"sheet_cells":100000,"rows_first":2000,"rows_last":500,"rows_between":2000,"halvings":0,"cell_chars":16384,"cell_head_chars":4096},"cells_cut":0,"cells_raw":0,"read":"whole","date_system":"1900"}

{"sheet":"Attente","index":0,"n_rows":200,"n_cols":9,"rows_kept":200,"cut":false,"hidden":false,"merged":[[1,1,1,8],[3,1,3,8],[5,1,5,8],[15,1,15,8]]}
[]
[null,"Outil de simulation des impacts économiques de pratiques agroforestières","Simulation tool to assess the economic impacts ","Outil de simulation des impacts économiques ","Simulation tool to assess the economic impacts ","Outil de simulation des impacts économiques ","Simulation tool to assess the economic impacts ","Outil de simulation des impacts économiques ","Simulation tool to assess the economic impacts "]
[]
[]
[]
[null,"Simulation tool to assess the economic impacts of agroforestry practices"]
[]
[]
[]
[]
[]
[]
[]
[]
[]
[null,"Veuillez patienter..."]
[]
[]
[]
[]
[]
[]
[]
[]
[]
[]
[]
[]
[]
[]
[]
[]
[]
[]
[]
[]
[]
[]
[]
[]
[]
[]
[]
[]
[]
[]
[]
[]
[]
[]
[]
[]
[]
[]
[]
[]
[]
[]
[]
[]
[]
[]
[]
[]
[]
[]
[]
[]
[]
[]
[]
[]
[]
[]
[]
[]
[]
[]
[]
[]
[]
[]
[]
[]
[]
[]
[]
[]
[]
[]
[]
[]
[]
[]
[]
[]
[]
[]
[]
[]
[]
[]
[]
[]
[]
[]
[]
[]
[]
[]
[]
[]
[]
[]
[]
[]
[]
[]
[]
[]
[]
[]
[]
[]
[]
[]
[]
[]
[]
[]
[]
[]
[]
[]
[]
[]
[]
[]
[]
[]
[]
[]
[]
[]
[]
[]
[]
[]
[]
[]
[]
[]
[]
[]
[]
[]
[]
[]
[]
[]
[]
[]
[]
[]
[]
[]
[]
[]
[]
[]
[]
[]
[]
[]
[]
[]
[]
[]
[]
[]
[]
[]
[]
[]
[]
[]
[]
[]
[]
[]
[]
[]
[]
[]
[]
[]
[]
[]
[]
["EN"]

{"sheet":"Langue","index":1,"n_rows":200,"n_cols":9,"rows_kept":200,"cut":false,"hidden":false,"merged":[[1,1,1,8],[5,1,5,8],[3,1,3,8],[15,1,15,8]]}
[]
[null,"Outil de simulation des impacts économiques de pratiques agroforestières","Simulation tool to assess the economic impacts ","Outil de simulation des impacts économiques ","Simulation tool to assess the economic impacts ","Outil de simulation des impacts économiques ","Simulation tool to assess the economic impacts ","Outil de simulation des impacts économiques ","Simulation tool to assess the economic impacts "]
[]
[]
[]
[null,"Simulation tool to assess the economic impacts of agroforestry practices"]
[]
[]
[]
[]
[]
[]
[]
[]
[]
[]
[]
[]
[]
[]
[]
[]
[]
[]
[]
[]
[]
[]
[]
[]
[]
[]
[]
[]
[]
[]
[]
[]
[]
[]
[]
[]
[]
[]
[]
[]
[]
[]
[]
[]
[]
[]
[]
[]
[]
[]
[]
[]
[]
[]
[]
[]
[]
[]
[]
[]
[]
[]
[]
[]
[]
[]
[]
[]
[]
[]
[]
[]
[]
[]
[]
[]
[]
[]
[]
[]
[]
[]
[]
[]
[]
[]
[]
[]
[]
[]
[]
[]
[]
[]
[]
[]
[]
[]
[]
[]
[]
[]
[]
[]
[]
[]
[]
[]
[]
[]
[]
[]
[]
[]
[]
[]
[]
[]
[]
[]
[]
[]
[null,null,null,null,null,0]
[]
[null,null,null,null,null,0]
[]
[null,null,null,null,null,0]
[]
[]
[]
[]
[]
[]
[]
[]
[]
[]
[]
[]
[]
[]
[]
[]
[]
[]
[]
[]
[]
[]
[]
[]
[]
[]
[]
[]
[]
[]
[]
[]
[]
[]
[]
[]
[]
[]
[]
[]
[]
[]
[]
[]
[]
[]
[]
[]
[]
[]
[]
[]
[]
[]
[]
[]
[]
[]
[]
[]
[]
[]
[]
[]
[]
[]
["FR"]

{"sheet":"Dictionnaire","index":2,"n_rows":1496,"n_cols":6,"rows_kept":1496,"cut":false,"hidden":false,"merged":[[0,0,1,1],[1402,0,1402,1],[108,0,108,1],[1075,0,1075,1],[714,0,714,1],[752,0,752,1],[30,0,30,1],[5,0,5,1],[9,0,9,1],[1370,0,1370,1],[1121,0,1121,1],[1161,0,1161,1],[1202,0,1202,1],[1295,0,1295,1],[21,0,21,1],[882,0,882,1],[1466,0,1466,1],[1447,0,1447,1],[442,0,442,1],[61,0,61,1],[77,0,77,1],[125,0,125,1],[360,0,360,1],[391,0,391,1],[481,0,481,1],[777,0,777,1],[930,0,930,1],[1016,0,1016,1],[1328,0,1328,1],[857,0,857,1]]}
["Traduction du logiciel"]
[]
["Paramètres","Parameters"]
["Français","Anglais"]
["Les informations ci-dessous sont utilisées lors des calculs mais elles ne sont pas remises à zéro lors d'une nouvelle simulation. Ces informations peuvent être modifiées et doivent être mises à jour régulièrement.  Elles peuvent être remises leur valeur par défaut en cliquant sur le bouton \"Paramètres par défaut\" ci-dessus.","The information below is used for calculation purposes but is not erased when a new simulation is started. This data can be modified and must be updated on a regular basis."]
["Informations concernant le taux d'actualisation et d'inflation"]
["Taux d'actualisation annuel ? (valeur calculée, ne pas modifier)","Discount rate per annum?"]
["Taux d'inflation annuel ? (utiliser les flèches pour modifier le pourcentage)","Annual inflation rate?"]
[]
["Informations concernant les coûts d'établissement"]
["Rouleau de pailllis de plastique de 1,2 ou 1,5 m de large","Plastic mulch roll (1.2 or 1.5 m in width)"]
["Petite collerette (30 cm X 30 cm)","Small plastic squares (30 cm X 30 cm)"]
["Grande collerette (1 m X 1 m)","Large plastic squares (1 m X 1 m)"]
["Biodisque (60 cm)","Biodisc (60 cm)"]
["Broches servant à fixer les collerettes","Metal clips"]
["broches/collerette","metal clips/collar"]
["Taux horaire pour la main d'œuvre lors de l'établissement et l'entretien de la haie ($/h)","Hourly labour rate for establishing and maintaining hedge ($/h)"]
["Frais de déplacement ($/km)","Travel expenses ($/km)"]
["Taux horaire pour les travaux mécaniques de préparation du sol ($/h)","Hourly rate for mechanical soil preparation work ($/h)"]
["Plans et devis (montant forfaitaire)","Drawings and specifications (contracted)"]
[]
["Informations concernant les coûts d'entretien"]
["Taux de mortalité anticipé la première année suivant la plantation","Mortality rate the year after the plantation"]
["Taux horaire (machinerie et main d'œuvre) pour le fauchage et l'inspection phytosanitaire ($/h)","Hourly rate (labour and machinery) for mowing and phytosanitary inspection ($/h)"]
["Taux horaire (machinerie et main d'œuvre) pour la taille de formation et l'élagage","Hourly rate (labour and machinery) for tree pruning ($/h)"]
["Nombre de fauchages par année","Number of mowing per year"]
["Frais de déplacement avec la machinerie ($/km)","Cost of transporting machinery ($/km)"]
["Spirale de protection contre les rongeurs","Anti-rodent spiral tree guard"]
["Gaine de protection contre les chevreuils (Climanet)","Anti-deer protective sleeve (installed)"]
[]
["Informations concernant les pertes liées à l'espace cultivable"]
["Marges sur coûts variables/ha, utilisés pour les calculs liés à la perte d'espace cultivable","Variable margin, return on expenditures/ha (used in calculating loss of cultivable area)"]
["Cultures","Crop"]
["Marge sur coûts variables/ha *","Variable margin, return on expenditures/ha *"]
["Foin","Forage"]
["Avoine","Oat"]
["Avoine biologique","Organic oat"]
["Blé d'alimentation animale","Animal feed wheat"]
["Blé d'alimentation humaine","Wheat for human consumption"]
["Blé panifiable biologique","Organic bread wheat"]
["Orge d'alimentation animale","Animal feed barley"]
["Orge biologique","Organic barley"]
["Maïs fourrager","Forage corn"]
["Maïs grain","Grain corn"]
["Maïs grain biologique","Organic grain corn"]
["Soya","Soybean"]
["Soya alimentation humaine biologique","Soy Organic Food"]
["Canola","Canola"]
["Canola biologique","Organic canola"]
["Autre 1**","Other 1**"]
["Autre 2**","Other 2**"]
["Autre 3**","Other 3**"]
["Autre 4**","Other 4**"]
["Autre 5**","Other 5**"]
["Autre 6**","Other 6**"]
["Autre 7**","Other 7**"]
["Autre 8**","Other 8**"]
["Autre 9**","Other 9**"]
["Autre 10**","Other 10**"]
["Autre 11**","Other 11**"]
[]
["Informations concernant les revenus liés à la récolte du bois"]
["Prix de vente incluant le transport","Income from wood harvesting including transport"]
["Essences","Species"]
["Valeur si le bois est vendu pour le sciage ","Value when sold for lumber"]
["Valeur si le bois est vendu pour le déroulage ","Value when sold for rotary cutting"]
["Valeur si le bois est vendu pour du bois de chauffage ","Value when sold for heating"]
["Valeur de la biomasse brut (pâte ou autres destinations) ","Value of raw biomass (for pulp or other purposes)"]
["$/Corde de 8' (non débité)","$/8-foot cord (non debited)"]
["$/TMV","$/green metric ton"]
["Épinettes, Pins ou Thuyas","Spruce, pine, cedar"]
["Peupliers hybrides","Hybrid poplar"]
["Feuillus nobles","Hardwoods"]
["Saules hybrides (tonne M.S.)","Hybrid willow (ton D.M.)"]
[]
["Le menu simulation permet de changer tous ces paramètres","The simulation menu offers the opportunity to modify these parameters"]
[]
["Informations concernant les revenus liés à l'amélioration des rendements"]
["Quelle est la hauteur maximale d'une haie de peupliers hybrides à maturité?","Maximum height of hybrid poplar hedge at maturity?"]
["Quelle est la hauteur maximale d'une haie de conifères ou de feuillus nobles à maturité?","Maximum height of conifer/hardwood hedge at maturity?"]
["Quelle est la hauteur maximale d'une haie de saules à maturité?","Maximum height of willow hedge at maturity?"]
["Quelle est la hauteur maximale d'une haie d'arbustes à maturité?","Maximum height of shrub hedge at maturity?"]
["Augmentations de la marge (produits sur débours/ha) utilisées pour les calculs liées à la protection de culture (résultat obtenu en multipliant le rendement par le prix à la tonne par une augmentation de rendement de 1%).","Margin (return on expenditures/ha) improvements, used in calculating data related to crop protection (1% yield increase)"]
["Cultures","Crop"]
["Augmentation de la marge (produits sur débours/ha) avec protection de culture*","Improved margin (return on investment/ha) with crop protection*"]
["Foin","Forage"]
["Avoine","Oat"]
["Blé (alimentation animale)","Wheat (animal feeding)"]
["Orge","Barley"]
["Maïs fourrager","Forage corn"]
["Maïs grain","Grain corn"]
["Soya","Soybean"]
["Haricot sec","Blueberry"]
["Autre 1**","Other 1**"]
["Autre 2**","Other 2**"]
["Autre 3**","Other 3**"]
["Autre 4**","Other 4**"]
["Autre 5**","Other 5**"]
["Autre 6**","Other 6**"]
["Autre 7**","Other 7**"]
["Autre 8**","Other 8**"]
["Autre 9**","Other 9**"]
["Autre 10**","Other 10**"]
["Autre 11**","Other 11**"]
["** Modifier les noms pour pouvoir les sélectionner dans le choix de la rotation du questionnaire","** Change the names to select them in the choice of the rotation of the questionnaire"]
["*(adaptés des budgets du CRAAQ, 2018, 2019, 2020 et 2021)","*(adapted from CRAAQ budgets, 2018, 2019, 2020 et 2021)"]
["Informations concernant les paramètres ","Information on parameters"]
[]
["Menu principal"]
["Français","Anglais"]
["Outil de simulation des impacts économiques ","Simulation tool to assess the economic impacts "]
["de pratiques agroforestières","of agroforestry practices"]
["Ce programme de simulation a été conçu pour faciliter la prise de décision lors de l'établissement de haies brise-vent, de bandes riveraines boisées ou de massifs de saule. ","This simulation program was developed to assist in making decisions when establishing a shelterbelt or a wooded riparian buffer. "]
["Dans le cas d'une première utilisation, il est conseillé de consulter les rubriques \"Instructions\" et \"Paramètres économiques\" avant de commencer. ","Before initial use, we recommend reading the \"Instructions\" and \"Economic parameters\" sections."]
["Pour débloquer les macros, veuillez enregistrer le fichier sur votre disque dur et cliquer sur le lien ci-dessous pour la procédure.","To activate macros, you should save the file on your hard drive first then click on the link below for the tutorial."]
["Débloquer les macros (Microsoft)","Activating macros (Microsoft)."]
["Révisé février 2024","Revised February, 2024"]
[]
["À propos du logiciel","About this program"]
["Français","Anglais"]
["Outil de simulation des impacts économiques de pratiques agroforestières version 24.02.1 (février 2024)","Simulation tool to assess the economic impacts of agro-forestal practices version 24.02.1 (February, 2024)"]
[]
["Remerciements","Acknowledgements"]
["Français","Anglais"]
[]
["Questionnaire"]
["Français","Anglais"]
["Section 1 : Établissement de la haie","Section 1: Establishing the hedge"]
["Taux d'actualisation annuel ?","Discount rate per annum?"]
["Longueur de la haie (m) ?","Length of hedge (m)?"]
["Nombre de rangées ? (maximum 7)","Number of rows (up to 3)?"]
["Espacement entre les rangées (m) ?","Spacing between rows (m)?"]
["Quelle est la séquence d'établissement des arbres et/ou arbustes ?","Planting sequence of trees/shrubs?"]
["Espèce no.1","Species 1"]
["Espèce no.2","Species 2"]
["Espèce no.3","Species 3"]
["Espèce no.4","Species 4"]
["Espèce no.5","Species 5"]
["Espèce no.6","Species 6"]
["Espèce no.7","Species 7"]
["Rangée 1","Row 1"]
["Rangée 2","Row 2"]
["Rangée 3","Row 3"]
["Rangée 4","Row 4"]
["Rangée 5","Row 5"]
["Rangée 6","Row 6"]
["Rangée 7","Row 7"]
["Quel est l'espacement entre les végétaux (m) ?","Spacing between plants (m) ?"]
["Rangée 1","Row 1"]
["Rangée 2","Row 2"]
["Rangée 3","Row 3"]
["Rangée 4","Row 4"]
["Rangée 5","Row 5"]
["Rangée 6","Row 6"]
["Rangée 7","Row 7"]
["Type de paillis utilisé ?","Type of plastic mulch used ?"]
["Largeur du plastique si déroulé ?","Width of unrolled plastic mulch ?"]
["pieds","feet"]
["Déroulé en longueur","Rolled down"]
["Grandes collerettes","Large plastic squares"]
["Biodisques","Biodisc"]
["Oui","Yes"]
["Non","No"]
["Quels sont les coûts des végétaux ($) ?","Cost of plants ($) ?"]
["Épinettes, Pins ou Thuyas (CON)","Spruce, pine, cedar (CON)"]
["Peupliers hybrides (PEH)","Hybrid poplar (HPO)"]
["Feuillus nobles (FNO)","Hardwoods (HWD)"]
["Arbustes (ARB)","Shrubs (SHR)"]
["Saules hybrides (SAH)","Hybrid willow (HWL)"]
["Inscrire la distance entre le site d'établissement et le point de départ des ouvriers","Indicate distance between planting site and location of workers"]
["Subvention (programme Prime-Vert par défaut)","Grant (Prime-Vert program by default)"]
["Spécifier:","Specify:"]
["Désirez-vous effectuer votre établissement avec des arbres de fort calibre ?","Will you be planting large trees?"]
[]
["Section 2 : Entretien de la haie","Section 2: Maintaining the hedge"]
["Désirez-vous effectuer les activités d'entretien suivantes ?","Will you be conducting the following maintenance operations?"]
["Remplacement des arbres morts la deuxième année","Replacement of dead trees in the second year"]
["Fauchage et inspection phytosanitaire (1 fois par an, 1 à 5 ans)","Mowing and phytosanitary inspection (once a year, years 1 to 5)"]
["Taille de formation et élagage","Pruning"]
["Recépage des arbustes","Shrub coppicing"]
["Protection contre les ravageurs","Protection from deers and rodents "]
["Si oui, spécifiez lesquels","If so, select one option:"]
["Subventions","Grants"]
[]
["Section 3 : Perte d'espace cultivable ","Section 3: Loss of cultivable area"]
["Si la longueur  de la haie est de ","If length of planned hedge is "]
["Quelle est la longueur de la haie implantée dans un champ cultivé ?","What will be the length of the hedge to be established in a crop field?"]
["Quelle est la durée de la rotation de culture ?","Duration of rotation?"]
["Quelle est la rotation de culture ?","Sequence of rotation?"]
["ans","years"]
["1re","1st"]
["2e","2nd"]
["3e","3rd"]
["4e","4th"]
["5e","5th"]
["6e","6th"]
["7e","7th"]
["8e","8th"]
["9e","9th"]
["10e","10th"]
["11e","11th"]
["12e","12th"]
["13e","13th"]
["14e","14th"]
["15e","15th"]
["16e","16th"]
["17e","17th"]
["18e","18th"]
["19e","19th"]
["20e","20th"]
[]
["Section 4 : Chauffage des bâtiments d'élevage","Section 4: Heating of livestock buildings"]
["Quels sont les coûts annuels de chauffage des bâtiments qui seront protégés?","Annual heating costs of buildings that will be protected by the hedge?"]
["Quel est le type de ventilation de votre bâtiment?","Type of ventilation of the livestock building?"]
["À quel pourcentage s'élèveront les économies de chauffage à la maturité des haies ?","Percentage of savings on heating costs when hedge reaches maximum height?"]
[]
["Section 5 : Déneigement","Section 5: Snow removal"]
["Combien d'heures par année sont consacrées aux opérations de déneigement dans le secteur qui sera protégé par la haie ?","Number of hours spent each year on snow removal operations in the area to be protected by the hedge?"]
["heures","hours"]
["Taux horaire pour les opérations de déneigement ?","Hourly wage rate for snow removal operations?"]
["$/heures","$/hours"]
[]
["Section 6 : Récolte de bois","Section 6: Wood harvesting"]
["Quelle espèce prévoyez-vous récolter ?","What species will be harvested?"]
["À quelle fin destinez-vous le bois?","Planned purpose of timber?"]
["Quel pourcentage de marge brute prévoyez-vous en retirer ?","Gross margin expected from the harvest?"]
["Voulez-vous récolter du bois ou de la biomasse?","Do you want to harvest wood or biomass?"]
["Section 7 : Récolte de petits fruits","Section 7: Small fruit harvesting"]
["Parmi les arbustes que vous désirez établir, quel pourcentage sont des arbustes fruitiers ?","Percentage of shrubs expected to produce fruits?"]
["Prévoyez-vous récolter des fruits ?","Are you planning on harvesting this fruit?"]
["Si oui, combien de kg par plant ?","If so, how many kg per plant do you plan on harvesting?"]
["kg/plant","kg/plant"]
["À quel prix ?","Expected sales price of fruit?"]
["Quel pourcentage de marge brute prévoyez-vous en retirer ?","Gross margin expected from the harvest?"]
[]
["Section 8 : Pertes de sol ","Section 8: Losses caused by soil erosion "]
["(Ne s'applique pas à la protection des bâtiments)","(Does not apply to shelterbelts established to protect livestock buildings)"]
["À combien évaluez-vous la valeur des pertes de sol ?","Estimated value of losses caused by soil erosion?"]
[" $/ha/année"," $/ha/year"]
[]
["Section 9 : Amélioration des rendements de culture ","Section 9: Improved yields "]
["(Ne s'applique pas à la protection des bâtiments)","(Does not apply to shelterbelts established to protect livestock buildings)"]
["Est-ce que la haie offrira une protection pour les cultures ?","Will hedge provide protection for crops?"]
["Quelle est la longueur de la haie qui protégera un champ cultivé ?","What will be the length of the hedge that will protect a crop field?"]
["Sur quel multiple de la hauteur (H) l'augmentation de rendement est-elle perceptible ?","On which multiple of height (H) the improvement of yields is visible?"]
["Quel pourcentage d'amélioration de rendement anticipez-vous ?","Anticipated percentage of improvement in yields?"]
[]
["Section 10 : Crédits de carbone","Section 10: Carbon credits"]
["À combien évaluez-vous le prix de la réduction d’une tonne des GES ?","Estimated value of GHG reductions per ton?"]
["/tonne CO2","/ton CO2"]
[]
["Informations","Information"]
["Est-ce que la haie offrira une protection pour les cultures ?","Is the hedge designed to provide protection for crops?"]
["Quels sont les coûts annuels de chauffage des bâtiments qui seront protégés?","What are your current heating costs?"]
["Quel est le type de ventilation de votre bâtiment?","Type of ventilation of the livestock building?"]
[" À quel pourcentage d'économie s'élèveront les économies de chauffage à la maturité des haies ?"," Percentage of savings on heating costs when hedge reaches maximum height"]
["Combien d'heures par année sont consacrées aux opérations de déneigement ?","Number of hours spent each year on snow removal operations?"]
["Taux horaire pour les opérations de déneigement ?","Hourly wage rate for snow removal operations?"]
["Longueur de la haie (m) ?","Length of hedge (m)?"]
["Nombre de rangée ? (maximum 7)","Number of rows (up to 3)?"]
["Espacement entre les rangées (m) ?","Spacing between rows (m)?"]
["Quels sont les coûts des végétaux ($) ?","Cost of plants ($)?"]
["Quelle est la séquence d'établissement des arbres et/ou arbustes ?","Planting sequence of trees/shrubs?"]
["Inscrire la distance entre le site d'établissement et le point de départ des ouvriers","Indicate distance between planting site and location of workers"]
["Quel est l'espacement entre les végétaux (m) ?","Spacing between plants (m)?"]
["Quelle largeur de paillis de plastique utiliserez-vous ?","Width of plastic mulch?"]
["Quel est le pourcentage des coûts d'établissement qui sera remboursé par des subventions ?","Percentage of establishment costs to be covered by grants?"]
["Est-ce que vous voulez effectuer votre établissement avec des arbres de fort calibre ?","Will you be planting large trees?"]
["Désirez-vous effectuer les activités d'entretiens suivantes ?","Will you be conducting the following maintenance operations?"]
["Quelle est la longueur de la haie implantée dans un champ cultivé ?","Length of hedge established in the field?"]
["Quelle est la durée de la rotation de culture ?","Duration of rotation?"]
["Quelle est la rotation de culture ?","Type of rotation?"]
["Quel bois prévoyez-vous récolter ?","Type of timber to be harvested?"]
["À quelle fin destinez-vous le bois?","Planned purpose of timber?"]
["Quel pourcentage de marge brute prévoyez-vous en retirer ?","Gross margin expected from the harvest?"]
["Parmis les arbustes que vous désirez établir, quel pourcentage sont des arbustes fruitiers ?","Percentage of shrubs expected to produce fruits?"]
["Prévoyez-vous de récolter les fruits","Are you planning on harvesting this fruit?"]
["Combien de kg par plant prévoyez-vous récolter ?","How many kg per plant do you plan on harvesting?"]
["À quel prix prévoyez-vous vendre les petits fruits ?","Expected sales price of fruit?"]
["Quel pourcentage de marge brute prévoyez-vous en retirer ?","Gross margin expected from the harvest?"]
["À combien évaluez-vous la valeur des pertes de sol ?","Estimated value of lost soil?"]
["Quel pourcentage d'amélioration de rendement anticipez-vous ?","Anticipated percentage of improvement in yields?"]
["À combien évaluez-vous le prix de la réduction d’une tonne des GES ?","Estimated value of GHG reductions per ton?"]
[]
["CON","CON"]
["PEH","HPO"]
["FNO","HWD"]
["ARB","SHR"]
["SAH","HWL"]
["Toutes","All"]
["Sciage","Lumber"]
["Déroulage","Rotary cutting"]
["Bois de chauffage","Heating"]
["Pâte ou biomasse","Pulp & biomass"]
["Sciage et pâte","Lumber & pulp"]
["Quelle(s) rangée(s) voulez-vous récolter ?","Which row do you want to harvest?"]
["Menu simulation","Simulation menu"]
["Français","Anglais"]
["Étape 1 : choisissez à quelle fin vous désirez faire l'implantation de vos végétaux","Step 1: Select the type of agroforestry system you will implement"]
["Étape 2 : complétez le questionnaire","Step 2: Fill out questionnaire"]
[]
[]
["Questionnaire Saule","Willow questionnaire"]
["Français","Anglais"]
["Section 1 : Paramètres économiques","Section 1: Economic parameters"]
["Taux d'intérêt du dernier emprunt (%)","Interest rate of the most recent loan (%)"]
["Coût d'opportunité annuel ($/ha)","Annual opportunity cost ($ / ha)"]
[]
["Section 2 : Implantation","Section 2: Installation"]
["Superficie du champ","Field Area "]
["Nombre de plants par hectare","Number of plants per hectare"]
["Abouts de champ (% de la superficie totale)","Headlands (% of total area)"]
["Coût des boutures ($)","Cuttings cost ($)"]
["Distance entre le site d'établissement et le point de départ des ouvriers (km)","Distance between the site preparation and the starting point for the workers (km)"]
["Préparation du sol","Soil Preparation"]
["(cocher les étapes qui s'appliquent)","(check steps that apply)"]
["Mode de plantation","Method of planting"]
[]
["Section 3 : Entretien de la plantation","Section 3: Maintenance of the plantation"]
["Désirez-vous effectuer les activités d'entretien suivantes ?","Will you perform the following maintenance activities?"]
["(cocher les activités qui s'appliquent)","(check the activities that apply)"]
["Désherbage de la plantation","Mowing"]
["(cocher une seule activité)","(check only one)"]
[]
["Section 4 : Récolte","Section 4: Harvest"]
["Frais de récolte et conditionnement (incluant transport)","Harvesting and conditionning costs (including transportation)"]
["Rendement annuel attendu","Expected annual return"]
["Prix de vente attendu","Expected selling price"]
[]
["Section 5 : Crédits de carbone","Section 5: Carbon Credits"]
["À combien évaluez-vous le prix de la réduction d’une tonne des GES ?","Price of  a tonne of GHG reduced?"]
[]
["Informations","Information"]
["Taux d'intérêt du dernier emprunt (%)","Interest rate of the most recent loan (%)"]
["Coût d'opportunité annuel ($/ha)","Annual opportunity cost ($ / ha)"]
["Superficie du champ","Field area"]
["Nombre de plants par hectare","Number of plants per hectare"]
["Abouts de champ (% de la superficie totale)","Headlands (% of the total area)"]
["Coût des boutures ($)","Cuttings cost ($)"]
["Distance entre le site d'établissement et le point de départ des ouvriers (km)","Distance between the site preparation and the starting point for the workers (km)"]
["Débroussaillage mécanique","Bush clearing"]
["Application de glyphosate","Application of glyphosate"]
["Épierrement","Rock removal"]
["Sous-solage","Subsoiling"]
["Travail primaire du sol","Primary soil tillage"]
["Travail secondaire du sol","Secondary soil tillage"]
["Pose de paillis plastique","Plastic mulch installation"]
["Mode de plantation","Planting method"]
["Recépage","Cut back"]
["Fertilisation","Fertilisation"]
["Désherbage de la plantation","Weeding"]
["Frais de récolte","Harvesting costs"]
["Rendement annuel attendu","Expected annual return"]
["Prix de vente attendu","Expected selling price"]
["À combien évaluez-vous le prix de la réduction d’une tonne des GES ?","Price of  a ton of GHG reduced?"]
["$/tma","$/tma"]
["tma/ha","tma/ha"]
["$/tonne GES","$/ton GHG"]
[]
[]
["Calculs Saule"]
["Français","Anglais"]
["Taux horaire","Hourly rate"]
["Vitesse moyenne","Average speed"]
["Superficie","Area"]
["Superficie totale du champ (ha)","Total field area (ha)"]
["Superficie plantée","Area planted"]
["Implantation","Implantation"]
["Boutures","Cuttings"]
["Préparation du sol","Soil Preparation"]
["Débroussaillage","Bush clearing"]
["Glyphosate","Glyphosate"]
["Épierrement","Stone removal"]
["Sous-solage","Subsoiling"]
["Travail primaire du sol","Primary soil tillage"]
["Travail secondaire du sol","Secondary soil tillage"]
["Pose de paillis plastique","Laying plastic mulch"]
["Plantation","Plantation"]
["Total implantation","Total implantation"]
["Entretien","Maintenance"]
["Recépage (automne année 1)","Cut back (Fall of Year 1)"]
["Fertilisation (cyclique)","Fertilization (cyclic)"]
["Fauchage (année 1)","Mowing (year 1)"]
["Désherbage chimique (année 1)","Chemical weed control (year 1)"]
["Sarclage mécanique (année 1)","Mechanical weeding (year 1)"]
["Récolte","Harvest"]
["Revenus","Revenue"]
["Vente biomasse","Sale biomass"]
["Crédits carbone","Carbon credits"]
[]
[]
["Coûts de référence"]
["Français","Anglais"]
["Boutures","Cuttings"]
["Source: Agro-Énergie -  Liste de prix 2008-2009.doc","Source: Agri-Energy - Price List 2008-2009.doc"]
["Quantité commandée","Quantity ordered"]
["Boutures coupées de 20 cm","Cuttings of 20 cm cut"]
["et plus","and more"]
["Nombre de tiges à l'hectare:","Number of cuttings per hectare:"]
["Nombre de boutures nécessaires:","Number of cuttings needed:"]
["Coût des boutures selon la quantité:","Cuttings cost by the quantity:"]
[]
["Paramètres économiques","Economic parameters"]
["Taux d'intérêt dernier emprunt","Interest rate of the most recent loan (%)"]
["Coût d'opportunité","Opportunity cost"]
[]
["Implantation","Implantation"]
["Superficie du champ","Field area"]
["Nb plants/ha","No. plants / ha"]
["Abouts de champ","Headlands "]
["Coût boutures","Cuttings cost"]
["Distance","Distance"]
[]
["Préparation du sol","Soil Preparation"]
["Débroussaillage mécanique","Bush clearing"]
["Application de glyphosate","Application of glyphosate"]
["Épierrement","Stone removal"]
["Sous-solage","Subsoiling"]
["Travail primaire du sol","Primary soil tillage"]
["Travail secondaire du sol","Secondary soil tillage"]
["Pose de paillis plastique","Laying plastic mulch"]
[]
["Plantation","Plantation"]
["Mécanique","Mechanical"]
["Manuelle","Manual"]
[]
["Entretien","Maintenance"]
["Recépage","Cut back"]
["Fertilisation","Fertilization"]
["Fauchage (année 1)","Mowing (year 1)"]
["Désherbage chimique (année 1)","Chemical weed control (year 1)"]
["Sarclage mécanique (année 1)","Mechanical weeding (year 1)"]
[]
["Récolte","Harvest"]
["Coût récolte","Harvest Cost"]
["Rendement","Yield"]
["Prix vente","Sale Price"]
[]
["Crédit carbone","Carbon credit"]
["Prix crédit carbone 1 tonne GES","Carbon credit prices 1 ton GHG"]
[]
[]
["Bilan des calculs Saule"]
["Français","Anglais"]
["Tableau synthèse de la progression de la marge","Summary table of the progression of updated"]
["actualisée cumulative","cumulative margin"]
["(en $ d'aujourd'hui)","(in dollars today)"]
["Délai de récupération ","Payback"]
["ans","years"]
[]
["Année","Year"]
["Taux d'actualisation","Rate"]
["Revenus actualisés","Discounted"]
["Dépenses actualisées","Updated cost estimates"]
["Marge actualisée","Margin updated"]
["Marge actualisée cumulative","Updated cumulative margin"]
["Coût d'opportunité","Opportunity cost"]
["Coût d'opportunité cumulatif","Cumulative opportunity cost"]
[]
["Tableau détaillé de la progression de la marge actualisée cumulative","Detailed table of the progression of updated cumulative margin"]
["(en $ d'aujourd'hui)","(in dollars today)"]
["Année","Years"]
["Taux d'actualisation","Rate"]
["Marge actualisée de l'année en cours","Margin updated this year"]
["Marge actualisée cumulative","Last updated cumulative margin"]
["Coûts des boutures","Cuttings cost"]
["Coût préparation du sol","Cost of soil preparation"]
["Coût de la plantation","Cost of planting"]
["Coût entretien","Maintenance cost"]
["Coût récolte","Harvesting cost"]
["Revenus de vente de biomasse","Revenues from sale of biomass"]
["Revenus liés aux crédits carbones","Revenues related to carbon credits"]
[]
["Tableau en $ / tonne","Table in $ / ton"]
["(en $ d'aujourd'hui)","(in dollars today)"]
["Revenus actualisés","Discounted"]
["Dépenses actualisées","Updated cost estimates"]
["Marge actualisée","Margin updated"]
["Marge actualisée cumulative","Updated cumulative margin"]
[" "]
[]
["Compilation"]
["Français","Anglais"]
["Simulations sauvegardées","Saved simulations"]
["Description du scénario","Simulation description"]
["Date","Date"]
[]
["Paramètres","Parameters"]
["Taux d'actualisation annuel ? (valeur calculée, ne pas modifier)","Discount rate per annum?"]
["Taux d'intérêt perçu sur les placements ?","Interest rate on investments?"]
["Taux d'intérêt payé sur les emprunts ?","Interest rate on loans payable?"]
["Taux d'inflation annuel ? (utiliser les flèches pour modifier le pourcentage)","Annual inflation rate?"]
["Prix d'un rouleau de pailllis de plastique de 1,2 ou 1,5 m de large","Cost of plastic mulch roll (1.2 or 1.5 m in width)"]
["Prix d'une collerette","Cost of plastic squares"]
["Prix unitaire des broches servant à fixer les collerettes","Cost of metal clips"]
["Taux horaire pour la main d'œuvre lors de l'établissement et l'entretien de la haie ($/h)","Hourly labour rate for establishing and maintaining hedge ($/h)"]
["Frais de déplacement ($/km)","Travel expenses ($/km)"]
["Taux horaire pour les travaux mécaniques de préparation du sol ($/h)","Hourly rate for mechanical soil preparation work ($/h)"]
["Plans et devis (montant forfaitaire)","Drawings and specifications (contracted)"]
["Pourcentage des frais d'implantation prévus pour le remplacement des arbres mort la première année","Percentage of installation costs allowed for replacement of dead trees in the first 12 months"]
["Taux horaire (machinerie et main d'œuvre) pour le fauchage et l'inspection phytosanitaire ($/h)","Hourly rate (labour and machinery) for mowing and phytosanitary inspection ($/h)"]
["Nombre de fauchages par année","Number of mowing per year"]
["Frais de déplacement avec la machinerie ($/km)","Cost of transporting machinery ($/km)"]
["Prix d'une spirale de protection contre les rongeurs","Cost of anti-rodent spiral tree guard"]
["Prix d'une gaine de protection contre les chevreuils (Freegro)","Cost of anti-deer protective sleeve (installed)"]
["Marges, produits sur débours/ha, utilisés pour les calculs liés à la perte d'espace cultivable","Margin, return on expenditures/ha (used in calculating loss of cultivable area)"]
["Foin","Forage"]
["Avoine","Oat"]
["Blé","Wheat"]
["Orge","Barley"]
["Maïs fourrager","Forage corn"]
["Maïs grain","Grain corn"]
["Soya","Soybean"]
["Autre 11","Blueberry"]
["Prix de vente excluant le transport","Income from wood harvesting "]
["Valeur si le bois est vendu pour le sciage ( $/m3)","Value when sold for lumber ( $/m3)"]
["Épinettes, Pins ou Thuyas","Spruce, pine, cedar"]
["Peupliers hybrides","Hybrid poplar"]
["Feuillus nobles","Hardwoods"]
["Valeur si le bois est vendu pour le déroulage ( $/m3)","Value when sold for rotary cutting ( $/m3)"]
["Peupliers hybrides","Hybrid poplar"]
["Feuillus nobles","Hardwoods"]
["Valeur si le bois est vendu pour du bois de chauffage ($/Corde de 4')","Value when sold for heating ($/4-foot cord)"]
["Feuillus nobles","Hardwoods"]
["Valeur de la biomasse brut (pâte ou autres destinations) ($/tonne M.S.ou $/m3)","Value of raw biomass (for pulp or other purposes) ($/ton D.M. or $/m3)"]
["Épinettes, Pins ou Thuyas","Spruce, pine, cedar"]
["Peupliers hybrides","Hybrid poplar"]
["Feuillus nobles","Hardwoods"]
["Saules hybrides (tonne M.S.)","Hybrid willow (ton D.M.)"]
["Quelle est la hauteur maximale d'une haie de peupliers hybrides à maturité?","Maximum height of hybrid poplar hedge at maturity?"]
["Quelle est la hauteur maximale d'une haie d'arbustes à maturité?","Maximum height of shrub hedge at maturity?"]
["Augmentations de la marge (produits sur débours/ha) utilisées pour les calculs liées à la protection de culture (basées sur une augmentation de rendement de 10%)","Margin (return on expenditures/ha) improvements, used in calculating data related to crop protection"]
["Foin","Forage"]
["Avoine","Oats"]
["Blé","Wheat"]
["Orge","Barley"]
["Maïs fourrager","Forage corn"]
["Maïs grain","Grain corn"]
["Soya","Soybean"]
["Haricot sec","Field bean"]
[]
["Questionnaire","Questionnaire"]
["1re étape : choisissez à quelle fin vous désirez faire l'implantation d'une haie brise-vent","Purpose of shelterbelt"]
["Section 1 : Établissement de la haie","Section 1: Establishing the hedge"]
["Taux d'intérêt du dernier emprunt","Interest rate of the last loan"]
["Longueur de la haie (m) ?","Length of hedge (m)?"]
["Nombre de rangées ? (maximum 7)","Number of rows (up to 3)?"]
["Espacement entre les rangées (m) ?","Spacing between rows (m)?"]
["Quelle est la séquence d'établissement des arbres et/ou arbustes ?","Planting sequence of trees/shrubs?"]
["Espèce no.1","Species 1"]
["Rangée 1","Row 1"]
["Rangée 2","Row 2"]
["Rangée 3","Row 3"]
["Rangée 4","Row 4"]
["Rangée 5","Row 5"]
["Rangée 6","Row 6"]
["Rangée 7","Row 7"]
["Espèce no.2","Species 2"]
["Rangée 1","Row 1"]
["Rangée 2","Row 2"]
["Rangée 3","Row 3"]
["Rangée 4","Row 4"]
["Rangée 5","Row 5"]
["Rangée 6","Row 6"]
["Rangée 7","Row 7"]
["Espèce no.3","Species 3"]
["Rangée 1","Row 1"]
["Rangée 2","Row 2"]
["Rangée 3","Row 3"]
["Rangée 4","Row 4"]
["Rangée 5","Row 5"]
["Rangée 6","Row 6"]
["Rangée 7","Row 7"]
["Espèce no.4","Species 4"]
["Rangée 1","Row 1"]
["Rangée 2","Row 2"]
["Rangée 3","Row 3"]
["Rangée 4","Row 4"]
["Rangée 5","Row 5"]
["Rangée 6","Row 6"]
["Rangée 7","Row 7"]
["Espèce no.5","Species 5"]
["Rangée 1","Row 1"]
["Rangée 2","Row 2"]
["Rangée 3","Row 3"]
["Rangée 4","Row 4"]
["Rangée 5","Row 5"]
["Rangée 6","Row 6"]
["Rangée 7","Row 7"]
["Espèce no.6","Species 6"]
["Rangée 1","Row 1"]
["Rangée 2","Row 2"]
["Rangée 3","Row 3"]
["Rangée 4","Row 4"]
["Rangée 5","Row 5"]
["Rangée 6","Row 6"]
["Rangée 7","Row 7"]
["Espèce no.7","Species 7"]
["Rangée 1","Row 1"]
["Rangée 2","Row 2"]
["Rangée 3","Row 3"]
["Rangée 4","Row 4"]
["Rangée 5","Row 5"]
["Rangée 6","Row 6"]
["Rangée 7","Row 7"]
["Quel est l'espacement entre les végétaux (m) ?","Spacing between plants (m)?"]
["Rangée 1","Row 1"]
["Rangée 2","Row 2"]
["Rangée 3","Row 3"]
["Rangée 4","Row 4"]
["Rangée 5","Row 5"]
["Rangée 6","Row 6"]
["Rangée 7","Row 7"]
["Quelle largeur de paillis de plastique utiliserez-vous ?","Width of plastic mulch?"]
["Quels sont les coûts des végétaux ($) ?","Cost of plants ($)?"]
["Épinettes, Pins ou Thuyas (CON)","Spruce, pine, cedar (CON)"]
["Peupliers hybrides (PEH)","Hybrid poplar (HPO)"]
["Feuillus nobles (FNO)","Hardwoods (HWD)"]
["Arbustes (ARB)","Shrubs (SHR)"]
["Saules hybrides (SAH)","Hybrid willow (HWL)"]
["Inscrire la distance entre le site d'établissement et le point de départ des ouvriers","Indicate distance between planting site and location of workers"]
["Quel pourcentage des coûts d'établissement sera remboursé par des subventions ?","Percentage of establishment costs to be covered by grants?"]
["Désirez-vous effectuer votre établissement avec des arbres de fort calibre ?","Will you be planting large trees?"]
[]
["Section 2 : Entretien de la haie","Section 2: Maintaining the hedge"]
["Désirez-vous effectuer les activités d'entretien suivantes ?","Will you be conducting the following maintenance operations?"]
["Remplacement des arbres morts la première année","Replacement of dead trees in the first 12 months"]
["Fauchage et inspection phytosanitaire (2 fois par an, 1 à 5 ans)","Mowing and phytosanitary inspection (twice a year, years 1 to 5)"]
["Taille de formation (tous les ans, de 2 à 10 ans)","Pruning for shape (every year, years 2 to 10)"]
["Élagage (tous les 2 ans, de 10 à 30 ans)","Pruning for wood quality (every 2 year, years 10 to 30)"]
["Protection contre les ravageurs","Protection from pests"]
["Si oui, spécifiez lesquels","If so, select one option:"]
[]
["Section 3 : Perte d'espace cultivable ","Section 3: Loss of cultivable area"]
["Quelle est la longueur de la haie implantée dans un champ cultivé ?","What will be the length of the hedge to be established in a crop field?"]
["Quelle est la durée de la rotation de culture ?","Duration of rotation?"]
["Quelle est la rotation de culture ?","Sequence of rotation?"]
["1re","1st"]
["2e","2nd"]
["3e","3rd"]
["4e","4th"]
["5e","5th"]
["6e","6th"]
["7e","7th"]
["8e","8th"]
["9e","9th"]
[]
["Section 4 : Chauffage des bâtiments d'élevage","Section 4: Heating of livestock buildings"]
["Quels sont les coûts annuels de chauffage des bâtiments qui seront protégés?","Annual heating costs of buildings that will be protected by the hedge?"]
["Quel est le type de ventilation de votre bâtiment?","Type of ventilation of the livestock building?"]
["À quel pourcentage s'élèveront les économies de chauffage à la maturité des haies ?","Percentage of savings on heating costs when hedge reaches maximum height?"]
[]
["Section 5 : Déneigement","Section 5: Snow removal"]
["Combien d'heures par année sont consacrées aux opérations de déneigement dans le secteur qui sera protégé par la haie ?","Number of hours spent each year on snow removal operations in the area to be protected by the hedge?"]
["Taux horaire pour les opérations de déneigement ? ($/h)","Hourly wage rate for snow removal operations? ($/h)"]
[]
["Section 6 : Récolte de bois","Section 6: Wood harvesting"]
["Quelle espèce prévoyez-vous récolter ?","What species will be harvested?"]
["Peupliers hybrides (PEH)","Hybrid poplar (HPO)"]
["Épinettes, Pins ou Thuyas (CON)","Spruce, pine, cedar (CON)"]
["Feuillus nobles (FNO)","Hardwoods (HWD)"]
["Saules hybrides (SAH)","Hybrid willow (HWL)"]
["À quelle fin destinez-vous le bois?","Planned purpose of timber?"]
["Peupliers hybrides (PEH)","Hybrid poplar (HPO)"]
["Épinettes, Pins ou Thuyas (CON)","Spruce, pine, cedar (CON)"]
["Feuillus nobles (FNO)","Hardwoods (HWD)"]
["Saules hybrides (SAH)","Hybrid willow (HWL)"]
["Quel pourcentage de marge brute prévoyez-vous en retirer ?","Gross margin expected from the harvest?"]
["Peupliers hybrides (PEH)","Hybrid poplar (HPO)"]
["Épinettes, Pins ou Thuyas (CON)","Spruce, pine, cedar (CON)"]
["Feuillus nobles (FNO)","Hardwoods (HWD)"]
["Saules hybrides (SAH)","Hybrid willow (HWL)"]
[]
["Section 7 : Récolte de petits fruits","Section 7: Small fruit harvesting"]
["Parmi les arbustes que vous désirez établir, quel pourcentage sont des arbustes fruitiers ?","Percentage of shrubs expected to produce fruits?"]
["Prévoyez-vous récolter des fruits ?","Are you planning on harvesting this fruit?"]
["Si oui, combien de kg par plant ?","How many kg per plant do you plan on harvesting?"]
["À quel prix ?","Expected sales price of fruit?"]
["Quel pourcentage de marge brute prévoyez-vous en retirer ?","Gross margin expected from the harvest?"]
[]
["Section 8 : Pertes de sol (ne s'applique pas à la protection des bâtiments)","Section 8: Losses caused by soil erosion"]
["À combien évaluez-vous la valeur des pertes de sol ?","Estimated value of losses caused by soil erosion?"]
[]
["Section 9 : Amélioration des rendement de culture (ne s'applique pas à la protection des bâtiments)","Section 9: Improved yields (does not apply to shelterbelts established to protect livestock buildings)"]
["Est-ce que la haie offrira une protection pour les cultures ?","Will hedge provide protection for crops?"]
["Sur quel multiple de la hauteur (H) l'augmentation de rendement est-elle perceptible ?","On which multiple of height (H) the improvement of yields is visible?"]
["Quel pourcentage d'amélioration de rendement anticipez-vous ?","Anticipated percentage of improvement in yields?"]
[]
["Section 10 : Crédits de carbone","Section 10: Carbon credits"]
["À combien évaluez-vous le prix de la réduction d’une tonne des GES ? ($/tonne CO2)","Estimated value of GHG reductions per ton? ($/tonne CO2)"]
["Carbone séquestré (tonnes)","Cumulative discounted margin"]
[]
["Bilan des calculs","Balance calculations"]
["Marge actualisée cumulative","Last updated cumulative margin"]
["0-5 ans","0-5 years"]
["5-10 ans","5-10 years"]
["10-20 ans","10-20 years"]
["20-40 ans","20-40 years"]
["Coûts","Costs"]
["Coûts liés à l'implantation des écrans boisés","Shelterbelt implementation costs"]
["Coûts liés aux pertes d'espace cultivable","Crop losses"]
["Coûts liés à l'entretien des écrans boisés","Shelterbelt maintenance costs"]
["Bénéfices","Incomes"]
["Revenus liés aux économies de chauffage","Heating saving incomes"]
["Revenus liés aux économies de déneigement","Snow removal saving incomes"]
["Revenus liés à la production de petits fruits","Fruit yield incomes"]
["Revenus liés à la récolte du bois","Wood yield incomes"]
["Revenus liés à l'augmentation de rendement","Crop yield incomes"]
["Économies liées diminutions de pertes de sol","Soil loss reduction incomes"]
["Revenus liés aux crédits carbone","Carbon credit incomes"]
["Délai de récupération (ans)","Payback period (years)"]
["Revenus en bois non actualisés","Wood yield incomes not discounted"]
[]
[]
["Bilan des calculs"]
["Français","Anglais"]
["Tableau synthèse","Summary Table"]
[" (progression de la marge actualisée cumulative)"," (increase in cumulative discounted margin)"]
["Délai de récupération ","Payback"]
["Carbone séquestré (tonnes de CO² équivalent) après 40 ans","Carbon sequestered (ton CO ² equivalent) after 40 years"]
["Carbone séquestré (tonnes de CO² équivalent) après 25 ans","Carbon sequestered (ton CO ² equivalent) after 25 years"]
["Période","Period"]
["Améliorations","Improvements in incomes"]
["Détériorations","Decreases in incomes"]
["Marge","Margin (improvements-decreases)"]
["Marge actualisée ","Discounted margin"]
["Marge actualisée cumulative","Cumulative discounted margin"]
["0-5 ans","0-5 years"]
["5-10 ans","5-10 years"]
["10-20 ans","10-20 years"]
["20-40 ans","20-40 years"]
[]
["Résultats","Results"]
["Menus","Menus"]
[]
["Délai de récupération","Payback period"]
["ans","years"]
["Année","Year"]
["Marge actualisée de l'année en cours","Discounted margin for current year"]
["Marge actualisée cumulative","Cumulative discounted margin"]
["Coûts d'implantation des écrans boisés","Cost of establishing wooded hedges"]
["Coûts des pertes d'espace cultivable","Costs associated with loss of cultivable area"]
["Coûts de l'entretien des écrans boisés","Maintenance costs for wooded hedges"]
["Réduction des coûts de chauffage des bâtiments","Reduction in heating costs for buildings"]
["Réduction des coûts de déneigement","Reduction in snow removal costs"]
["Revenu en bois","Income from timber"]
["Revenu en PFNL","Income from nontimber forest product"]
["Amélioration de rendements","Yield improvements"]
["Diminution des pertes de sol","Reduction in soil losses"]
["Revenus liés aux crédits carbone","Income associated with carbon credits"]
[]
[]
["Coûts d'implantation"]
["Français","Anglais"]
["Coûts d'implantation des haies brise-vent autour des bâtiments d'élevage","Establishment costs for shelterbelts around livestock buildings"]
["Période","Period"]
["Améliorations","Improvements"]
["Détériorations","Decreases"]
["Marge","Margin"]
["Marge actualisée ","Discounted margin"]
["Marge actualisée accumulée","Cumulative discounted margin"]
["0-5 ans","0-5 years"]
["5-10 ans","5-10 years"]
["10-20 ans","10-20 years"]
["20-40 ans","20-40 years"]
[]
["Coûts liés à l'implantation de 0 à 5 ans","Establishment costs 0-5 years"]
["Coûts liés à l'implantation de 5 à 10 ans","Establishment costs 5-10 years"]
["Coûts liés à l'implantation de 10 à 20 ans","Establishment costs 10-20 years"]
["Coûts liés à l'implantation de 20 à 40 ans","Establishment costs 20-40 years"]
[]
["Détériorations","Costs calculation based on inflation and interest rates"]
["Marge actualisée","Calculation of discounted value of dollar"]
["Marge actualisée accumulée","Margin updated accumulated"]
["total cumulatif à l'an","Cumulative total per year"]
[]
[]
["Devis d'implantation des écrans"]
["Français","Anglais"]
["Longueur totale déroulée (m)","Total straightened length (m)"]
["Longueur de la haie (m)","Length of hedge (m)"]
["Nombre de rangées","Number of rows"]
["Longueur déroulée (m)","Straightened length (m)"]
["Espacement entre les rangs (m)","Spacing between rows (m)"]
["Numéro de la rangée","Row identification number"]
["Espacement entre les végétaux (m)","Spacing between plants (m)"]
["Nombre de végétaux","Number of plants"]
[]
["Arrangement des végétaux","Arrangement of plants"]
["Séquence d'arbres et/ou arbustes","Tree/shrub sequence"]
["Nombre de répétition par espèce","Number of duplicates per species"]
["Haie","Hedge"]
["Rangée","Row"]
["Longueur","Length"]
[]
["# rangée","Row #"]
["Essences","Species"]
["Total","Total"]
["$/unité","$/piece"]
["quantité","quantity"]
["Arbres*","Trees*"]
["Épinettes, Pins ou Thuyas","Spruce, pine, cedar"]
["Peupliers hybrides","Hybrid poplar"]
["Feuillus nobles","Hardwoods"]
["Arbustes","Shrubs"]
["Saules hybrides","Hybrid willow"]
["Nombre total de végétaux ","Total number of plants"]
["CON","CON"]
["PEH","HPO"]
["FNO","HWD"]
["ARB","SHR"]
["SAH","HWL"]
[]
["MATÉRIEL","MATERIAL"]
["Quantité","Quantity"]
["Coût unitaire ($)","Unit cost ($)",null,null,null," "]
["Coût total ($)","Total cost ($)"]
["Plastique (largeur en pied)","Plastic (width in feet)"]
["Collerettes","Plastic squares"]
["Broches (3 broches/collerette)","Metal clips (3 clips/plastic square)"]
[]
["MAIN D'ŒUVRE","LABOUR"]
["Temps requis (hres)","Time needed (hrs)"]
["Taux horaire ($/hre)","Hourly rate ($)"]
["Coût total ($)","Total cost ($)"]
["Pose paillis plastique (1 personne en plus de l'opérateur)","Plastic mulch installation (1 person + machine operator)"]
["Plantation (3 personnes)","Planting (3 people)"]
["Pose collerettes et broches (3 personnes)","Installing plastic squares and metal clips (3 people)"]
["Distance aller (km):","Distance to (km)"]
["Frais de déplacement","Travel expenses"]
[]
["TRAVAIL FORFAITAIRE","CONTRACT WORK"]
["Coût total ($)","Total cost ($)"]
["TRAVAIL PRIMAIRE DU SOL (Labour) (mettre un \"X\" si fait par producteur)","PRIMARY SOIL TILLAGE (indicate \"X\" if done by farmer)"]
["TRAVAIL SECONDAIRE DU SOL (Rotoculteur) (mettre un \"X\" si fait par producteur)","SECONDARY SOIL TILLAGE (rototiller) (indicate \"X\" if done by farmer)"]
["DÉROULAGE DU PLASTIQUE (mettre un \"X\" si  fait par producteur)","MULCH INSTALLATION (indicate \"X\" if done by farmer)"]
["TRANSPORT ARBRES","TRANSPORTATION OF TREES"]
["PLANS ET DEVIS","DRAWINGS AND SPECIFICATIONS"]
["inclus","included"]
[]
["SOUS-TOTAL SANS LES VÉGÉTAUX:","SUB-TOTAL EXCLUDING PLANTS:"]
["COÛT AU MÈTRE SANS VÉGÉTAUX:","COST PER METRE EXCLUDING PLANTS:"]
["TOTAL AVANT SUBVENTION:","TOTAL BEFORE GRANT:"]
["COÛT AU MÈTRE TOTAL AVEC VÉGÉTAUX:","TOTAL COST PER METRE INCLUDING PLANTS:"]
["Pourcentage de remboursement:","Reimbursement percentage:"]
[" DE REMBOURSEMENT PRIME-VERT :"," FROM PRIME-VERT PROGRAM:"]
["COÛT AU MÈTRE TOTAL AVEC VÉGÉTAUX:","TOTAL COST PER METRE INCLUDING PLANTS:"]
[]
["AVEC ARBRES DE FORT CALIBRE","WITH LARGE TREES"]
["Mettre un X pour des arbres de fort calibre","Indicate \"X\" for large trees"]
["Taux de conversion","Conversion ratio"]
["TOTAL AVANT SUBVENTION POUR DES ARBRES DE FORT CALIBRES:","TOTAL BEFORE GRANT FOR LARGE TREES: "]
["COÛT AU MÈTRE TOTAL AVEC VÉGÉTAUX DE FORT CALIBRES:","TOTAL COST PER METRE WITH LARGE TREES:"]
[" DE REMBOURSEMENT PRIME-VERT :"," REIMBURSED THROUGH PRIME-VERT PROGRAM:"]
["COÛT AU MÈTRE TOTAL AVEC VÉGÉTAUX:","TOTAL COST PER METRE INCLUDING TREES: "]
[]
[]
["Modèles de haies"]
["Français","Anglais"]
["Consutez le tableau ci-dessous, retenez le numéro de modèle de haie que vous désirez choisir puis allez l'inscrire dans la case appropriée du devis d'implantation","Identify the model number from the table below, then indicate this number in the appropriate field in the cost estimate sheet."]
["Numéro de modèle de haie","Model number"]
["Nombre de rangées","Number of rows"]
["Distance entre les rangées (m)","Distance between rows (m)"]
["Distance entre les arbres (m)","Distance between plants (m)"]
["Espèces d'arbres","Species"]
["rapidité de croissance (m/an)","Growth rate (m/year)"]
["production de bois (B) ou de petits fruits (Fr)","Wood (W) or small fruit (Fr) harvest"]
["réduction des coûts de chauffage","Reduction in heating costs"]
["réduction des coûts de déneigement","Reduction in snow removal costs"]
["remarques","Notes"]
["  * de façon moindre qu'avec des résineux","  * less so than with conifers"]
[]
["Numéro de modèle de haie","Model number"]
["Nombre de rangées","Number of rows"]
["Distance entre les rangées (m)","Distance between rows (m)"]
["Distance entre les arbres (m)","Distance between plants (m)"]
["Espèces d'arbres","Species"]
["Largeur à 5 ans","Width after 5 years"]
["Largeur à 10 ans","Width after 10 years"]
["Largeur à 20 ans","Width after 20 years"]
["Largeur à 40 ans","Width after 40 years"]
[]
["Entretien des écrans boisés"]
["Français","Anglais"]
["Entretien des écrans boisés","Maintenance of wooded hedges"]
["Période","Period"]
["Améliorations","Improvements"]
["Détériorations","Decreases"]
["Marge","Margin"]
["Marge actualisée ","Discounted margin"]
["Marge actualisée accumulée","Cumulative discounted margin"]
["0-5 ans","0-5 years"]
["5-10 ans","5-10 years"]
["10-20 ans","10-20 years"]
["20-40 ans","20-40 years"]
[]
["Coûts liés à l'entretien de 0 à 5 ans","Maintenance costs 0-5 years"]
["Coûts liés à l'entretien  de 5 à 10 ans","Maintenance costs 5-10 years"]
["Coûts liés à l'entretien  de 10 à 20 ans","Maintenance costs 10-20 years"]
["Coûts liés à l'entretien  de 20 à 40 ans","Maintenance costs 20-40 years"]
[]
["Remplacement des arbres morts la première année","Replacement of dead trees in the first 12 months"]
["Fauchage et inspection phytosanitaire les 5 premières années","Mowing and phytosanitary inspection in the first 5 years"]
["Protection contre les rongeurs les 10 premières années","Protection from rodents in the first 10 years"]
["Taille de formation de 2 à 10 ans ( tous les ans )","Shearing every year (years 2 to 10)"]
["Élagage de 10 à 30 ans ( aux 2 ans )","Pruning every year (years 2 to 10)"]
["Longueur totale des haies :","Total length of hedges "]
["Nombre d'arbres total :","Total number of trees"]
["arbres","trees"]
[]
["Remplacement des arbres morts la première année","Replacement of dead trees in the first 12 months"]
["Fauchage et inspection phytosanitaire les 5 premières années","Mowing and phytosanitary inspection in the first 5 years"]
["Protection contre les rongeurs les 10 premières années","Protection from rodents in the first 10 years"]
["Taille de formation de 2 à 10 ans aux 2 ans (1 à 3 m et 3 à 5 m)","Shearing every year (years 2 to 10)"]
["Élagage de 10 à 30 ans tous les deux ans (5 m et plus)","Pruning every year (years 2 to 10)"]
["Choix","Select one"]
["Coût","Cost"]
["Oui","Yes"]
["Non","No"]
["matériel","equipment"]
["installation X 2","Installation"]
["Rongeurs seulement avec spirales","Rodents (tree guard only)"]
["Chevreuils et rongeurs avec tubes (Freegro)","Deer and rodents (protective sleeve)"]
[]
["Détériorations","Costs calculation based on inflation and interest rates"]
["Marge actualisée","Calculation of discounted value of dollar"]
["Marge actualisée accumulée","Margin updated accumulated"]
["total cumulatif à l'an","Cumulative total per year"]
[]
[]
["Calcul espace cultivable"]
["Français","Anglais"]
["Perte d'espace cultivable","Loss of cultivable area"]
["Période","Period"]
["Améliorations","Improvements in incomes"]
["Détériorations","Decreases in incomes"]
["Marge","Margin (improvements-decreases)"]
["Marge actualisée ","Discounted margin"]
["Marge actualisée cumulative","Cumulative discounted margin"]
["0-5 ans","0-5 years"]
["5-10 ans","5-10 years"]
["10-20 ans","10-20 years"]
["20-40 ans","20-40 years"]
[]
["Coûts liés à l'espace cultivable de 0 à 5 ans","Losses associated with cultivable area 0-5 years"]
["Coûts liés à  l'espace cultivable de 5 à 10 ans","Losses associated with cultivable area 5-10 years"]
["Coûts liés à  l'espace cultivable de 10 à 20 ans","Losses associated with cultivable area 10-20 years"]
["Coûts liés à  l'espace cultivable de 20 à 40 ans","Losses associated with cultivable area 20-40 years"]
[]
["Haie","Hedge"]
["Bande riveraine","Riparian strip"]
["Largeur d'une rangée","Width of a row"]
["Non entretenu","Not maintained"]
["Entretenu","Maintained"]
["Entretenu SAH","Entretenu SAH"]
["Bande riveraine non entretenue","Riparian unmaintained"]
["Bande riveraine entretenue","Managed riparian"]
["5 ans","5 years"]
["10 ans","10 years"]
["20 ans","20 years"]
["40 ans","40 years"]
[]
["Nombre de rangées","Number of rows"]
["Longueur de la haie","Length of hedge"]
["Rangée 1","Row 1"]
["Rangée 2","Row 2"]
["Rangée 3","Row 3"]
["Rangée 4","Row 4"]
["Rangée 5","Row 5"]
["Rangée 6","Row 6"]
["Rangée 7","Row 7"]
[]
["Largeur récupéré pour la culture pour bande riveraine","Width of area recovered for crops"]
["Largeur en m à 5 ans","Length in m after 5 years"]
["Largeur en m à 10 ans","Length in m after 10 years"]
["Largeur en m  à 20ans","Length in m after 20 years"]
["Largeur en m  à 40ans","Length in m after 40 years"]
["Nb de rangée","Number of rows"]
["Non entretenu","With CON"]
["Entretenu","Without CON"]
["Bandes riveraines","Buffer strips"]
[]
["Longueur de la protection","Length of protection"]
["Rotation sur combien d'années ?","Rotation over how many years?"]
["Choix de rotation","Rotation"]
["Culture","Crop"]
["Marge produits sur investissement /ha","Margin or return on investment/ha"]
["Année de référence","Reference year"]
["Marge produits sur débours /ha","Margin (return on expenditures)/ha"]
[]
["Calcul de l'espace perdu","Calculation of surface loss"]
["Identification des haies","Identification of hedge"]
["Largeur en m à 5 ans","Length in m after 5 years"]
["Largeur en m à 10 ans","Length in m after 10 years"]
["Largeur en m  à 20 ans","Length in m after 20 years"]
["Largeur en m  à 40ans","Length in m after 40 years"]
[]
["Identification des haies","Identification of hedge"]
["Surface perdue à 5 ans (ha)","Surface loss after 5 years (ha)"]
["Surface perdue à 10 ans (ha)","Surface loss after 10 years (ha)"]
["Surface perdue à 20 ans (ha)","Surface loss after 20 years (ha)"]
["Surface perdue à 40 ans (ha)","Surface loss after 40 years (ha)"]
[]
["Calcul des revenus perdus","Calculation of income loss"]
["Identification des haies","Identification of hedge"]
["Revenus perdus de 0 à 5 ans","Income loss 0-5 years"]
["Revenus perdus de 5 à 10 ans","Income loss 5-10 years"]
["Revenus perdus de 10 à 20 ans","Income loss 10-20 years"]
["Revenus perdus de 20 à 40 ans","Income loss 20-40 years"]
[]
["Détériorations","Costs calculation based on inflation and interest rates"]
["Marge actualisée","Calculation of discounted value of dollar"]
["Marge actualisée accumulée","Margin updated accumulated"]
["total cumulatif à l'an","Cumulative total per year"]
[]
[]
["Références espace cultivable"]
["Français","Anglais"]
["MARGE PRODUITS SUR DÉBOURS  2014 (1)","MARGIN OF RETURN ON EXPENDITURES - 2014 (1)"]
[" (Selon les budgets 2014 de Guy Beauregard)"," (Based on 2014 budgets established by Guy Beauregard)"]
["CULTURE","CROP"]
["RENDEMENT","YIELD"]
["Prix stabilisé","Stabilized"]
["$ la tonne","price ($/ton)"]
["Augmentation","Increase"]
["MARGE ","MARGIN"]
["Marge avec protection de culture (évaluation moyenne à partir des budgets 2014 de M. Beauregard)","Margin with crop protection (average estimation based on Mr. Beauregard's 2014 budgets)"]
[]
["1. GRAINS","1. GRAINS"]
["1- Soya  sans intrants chimiques   (Prix stabilisé +  80 $/t)","1- Soybean, no chemical inputs (stabilized price + $80/t)"]
["2- Pois de conserverie ","2- Canning peas"]
["3- Canola   (avec fumier)","3- Canola, with manure"]
["4- Fève de couleur","4- Coloured beans"]
["5- Orge de brasserie 2 rangs  (Prix stabilisé + 25 $/t)","5- Brewing barley, 2 rows (stabilized price + $25/t)"]
["6- Orge de brasserie 6 rangs (Prix stabilisé + 15 $/t)","6- Brewing barley, 6 rows (stabilized price + $15/t)"]
["7- Maïs-grain  (semis direct)","7- Grain corn (no-till)"]
["8- Soya  semis direct (Prix stabilisé sans prime)","8- Soybean, no-till (stabilized price, no premium)"]
["9- Blé fourrager","9- Feed wheat"]
["10- Blé d'alimentation humaine","10- Food wheat"]
["11- Maïs-grain  (compensation ASRA 2006:  68,33 $/t)","11- Grain corn (FISI compensation in 2006: $68.33/t)"]
["12- Avoine nue (Prix stabilisé + 50 $ /t)","12- Naked oats (stabilized price + $50/t)"]
["13- Avoine semis direct","13 - Oats, no-till"]
["14- Soya  (Prix stabilisé sans prime)","14- Soybean (stabilized price, no premium)"]
["15- Avoine non grainée","15- Non-seeded oats"]
["16- Soya  avec prime  (Prix stabilisé +  85 $/t)","16- Soybean with premium (stabilized price + $85/t)"]
["17- Orge  utilisée comme plante-abri","17- Barley used as cover crop"]
["18- Avoine  utilisée comme plante-abri","18- Oats used as cover crop"]
["19- Orge non grainée","19- Non-seeded barley"]
["20- Lin pour la graine","20- Flax, for seeds"]
["21- Maïs-grain humide vendu récolte (Prix du marché 67.00 $ + compensation)","21- Grain corn, damp, sold at harvest (market price: $67.00 + compensation)"]
["22.- Maïs-grain sec vendu récolte (prix du marché 102.50 $ + compensation)","22- Grain corn, tough, sold at harvest (market price: $102.50 + compensation)"]
[]
["2. FOURRAGES ","2. FORAGES"]
["Maïs fourrager  silo couloir ( 35 % m.s.) (3)","Feed corn, bunker silo (35% D.M.)(3)"]
["Maïs fourrager  silo tour ( 35 % m.s.)","Feed corn, tower silo (35% D.M.)"]
["Pâturage intensif   (89% m.s.)","Intensive pasture (89% D.M.)"]
["Pâturage en rotation  (89% m.s.)","Rotation grazing (89% D.M.)"]
["Ensilage mil-luzerne en silo couloir  (36% m.s.)","Timothy-alfalfa silage, bunker silo (36% D.M.)"]
["Ensilage mil-luzerne annuelle en silo tour  (40% m.s.)","Annual timothy-alfalfa silage, tower silo (40% D.M.)"]
["Ensilage mil-luzerne en silo-tour (40% m.s.)","Timothy-alfalfa silage, tower silo (30% D.M.)"]
["Foin mil-luzerne semis pur  (89% m.s.)","Timothy-alfalfa hay, pure seeds (89% D.M.)"]
["Foin mil-luzerne avec orge (89% m.s.)","Timothy-alfalfa hay with barley (89% D.M.)"]
["Foin mil-luzerne pour le commerce  (Grosses presses)","Timothy-alfalfa hay, commercial grade (large baler)"]
["Foin mil-trèfle rouge avec orge (89% m.s.) (balles rondes)","Timothy-red clover hay with barley, round bales (89$ D.M.)"]
["Ensilage mil-trèfle rouge-balles rondes enrobées (50% m.s.)","Timothy-red clover silage, wrapped round bales (50% D.M.)"]
["Foin mil-brome pour le commerce  (Grosses presses)","Timothy-brome hay, commercial grade (large baler)"]
["Foin mil-trèfle rouge avec orge (petites balles rectangulaires)","Timothy-red clover hay with barley (small rectangular bales)"]
[]
["N.B. (1) Nous faisons l'hypothèse que toutes les terres et  équipements sont possédés par l'agriculteur.","NB    (1) We have assumed that all land and equipment is the property of the farmer."]
["        (2) Les marges varient avec les rendements et les prix obtenus. ","        (2) Margins vary depending on yield and sales prices. "]
["        (3) Basé sur un prix du foin de 130 $ la tonne à 89 % de matière sèche.","        (3) Based on hay price of $130/ton at 89% D.M."]
["(1)  MARGE PRODUITS SUR DÉBOURS = C'est ce qui reste à l'agriculteur pour vivre et effectuer les remboursements","(1)  Margin (return on expenditures): Amount net to the farmer to ensure his livelihood and service his medium and long term debt. This is a financial term. "]
["     sur les emprunts à moyen et à long terme de son entreprise. On parle ici en termes de gestion financière."]
[]
[]
["Calcul d'économie de chauffage"]
["Français","Anglais"]
["Réduction des coût de chauffage des bâtiments","Reduction in heating costs for livestock buildings"]
["Période","Period"]
["Améliorations","Improvements in incomes"]
["Détériorations","Decreases in incomes"]
["Marge","Margin (improvements-decreases)"]
["Marge actualisée ","Discounted margin"]
["Marge actualisée cumulative","Cumulative discounted margin"]
["0-5 ans","0-5 years"]
["5-10 ans","5-10 years"]
["10-20 ans","10-20 years"]
["20-40 ans","20-40 years"]
[]
["Économies liées au chauffage de 0 à 5 ans","Heating cost savings 0-5 years"]
["Économies liées au chauffage de 5 à 10 ans","Heating cost savings 5-10 years"]
["Économies liées au chauffage de 10 à 20 ans","Heating cost savings 10-20 years"]
["Économies liées au chauffage de 20 à 40 ans","Heating cost savings 20-40 years"]
[]
["Quels sont vos coûts de chauffage annuels actuels ?","What are your current heating costs?"]
["ou","or"]
["À combien s'élève votre facture d'énergie (incluant l'éclairage , la ventilation, etc…) ?","What are your total energy costs (including lighting, ventilation, etc.)?"]
["Les économies à la maturité des haies seront de :","Savings at maturity of hedges will be"]
["Efficacité de réduction des coûts de chauffage","Reduction in heating costs"]
["Sans PEH","With HPO"]
["Avec PEH","Without HPO"]
["Conservateur 5%","Conservative: 5%"]
["Réaliste 10%","Realistic: 10%"]
["Optimiste 15%","Optimistic: 15%"]
["0-5 ans","0-5 years"]
["5-10 ans","5-10 years"]
["10-20 ans","10-20 years"]
["20-40 ans","20-40 years"]
["Facteur de conversion pour les haies de feuillus seulement","Conversion ratio for hedges made of hardwoods only"]
["PEH seul après 20 ans","Only HPO after 20 years"]
[]
["Avec conifère, avec  PEH","With conifers and HPO"]
["* le facteur de correction pour les feuillus a été appliqué","* conversion ratio for hardwoods has been applied"]
["Sans conifère, avec PEH","Without conifers, with HPO"]
[]
["Amélioration","Costs calculation based on inflation and interest rates"]
["Marge actualisée","Calculation of discounted value of dollar"]
["Marge actualisée accumulée","Margin updated accumulated"]
["total cumulatif à l'an","Cumulative total per year"]
[]
[]
["Calcul d'économie de déneigement"]
["Français","Anglais"]
["Réduction des coûts de déneigement","Reduction in snow removal costs"]
["Période","Period"]
["Améliorations","Improvements in incomes"]
["Détériorations","Decreases in incomes"]
["Marge","Margin (improvements-decreases)"]
["Marge actualisée ","Discounted margin"]
["Marge actualisée cumulative","Cumulative discounted margin"]
["0-5 ans","0-5 years"]
["5-10 ans","5-10 years"]
["10-20 ans","10-20 years"]
["20-40 ans","20-40 years"]
[]
["Économies liées au déneigement de 0 à 5 ans","Savings in snow removal costs 0-5 years"]
["Économies liées au déneigement de 5 à 10 ans","Savings in snow removal costs 5-10 years"]
["Économies liées au déneigement de 10 à 20 ans","Savings in snow removal costs 10-20 years"]
["Économies liées au déneigement de 20 à 40 ans","Savings in snow removal costs 20-40 years"]
[]
["Combien d'heures par année sont consacrées aux opérations de déneigement ?","How many hours are spent each year in snow removal operations?"]
["Taux horaire pour les opérations de déneigement ?","Hourly rate for snow removal operations?"]
["Efficacité de réduction des coûts de déneigement","Snow removal cost savings"]
[" /heures"," /hours"]
[" $/heure"," $/hour"]
["0-5 ans","0-5 years"]
["5-10 ans","5-10 years"]
["10-20 ans","10-20 years"]
["20-40 ans","20-40 years"]
["Facteur de conversion pour les haies de feuillus seulement","Conversion ratio for hedges made of hardwoods only"]
["Conservateur 10%","Conservative: 10%"]
["Réaliste 20%","Realistic: 20%"]
["Optimiste 30%","Optimistic: 30%"]
["Conifère et /ou arbustes","Conifers and/or shrubs"]
[]
["Amélioration","Costs calculation based on inflation and interest rates"]
["Marge actualisée","Calculation of discounted value of dollar"]
["Marge actualisée accumulée","Margin updated accumulated"]
["total cumulatif à l'an","Cumulative total per year"]
[]
[]
["Références déneigement"]
["Français","Anglais"]
["PROJET D'ÉCRANS BOISÉS","WOODED SCREEN PROJECT"]
["COÛT DU DÉNEIGEMENT PAR L'ÉLEVEUR","SNOW REMOVAL COSTS WHEN DONE BY FARMER"]
["Cas no 1","1st case scenario"]
["Cas no 2","2nd case scenario"]
["Cas no 3","3rd case scenario"]
["Cas no 4","4th case scenario"]
["Moyenne","Average"]
["Retenu","Data used"]
[]
["Tracteur  H.P.","Tractor H.P."]
["Nombre de fois","Number of runs"]
["Nbre heures/fois (h)","Hours per run (hours)"]
["Total (h)","Total (hours)"]
["Litres/h","Litres/hour"]
["Litres total *","Total litres*"]
["Coût le litre diesel","Cost of diesel fuel"]
["Salaire opérateur","Operator wages"]
[]
["CALCULS","CALCULATION"]
["Amortisssement souffleur**","Depreciation on blower**"]
["Réparations souffleur","Repairs on blower"]
["Amortissement tracteur ***","Depreciation on tractor***"]
["Réparations tracteur","Repairs on tractor"]
["Carburant ","Fuel"]
["Huile x 15 %","Oil x 15%"]
["Opérateur 15 $/h","Operator ($15/hour)"]
[]
["Moyenne","Average"]
[" /fois"," /run"]
[" /heure"," /hour"]
[]
["* Consommation de carburant: travail moyen; utilise 60 % de la puissance de la prise de force.","*     Fuel consumption: average work load, requires 60% of PTO."]
["** Amortissement du souffleur: coût à l'achat  9 800 $ moins valeur de récupération 980 $ divisé par 10 ans.","**   Depreciation for blower: purchase cost ($9,800) less salvation value ($980) divided by 10 years. "]
["*** Amortissement du tracteur: coût d'achat d'un tracteur de 90 H.P. moins sa valeur de récupération divisé","*** Depreciation for tractor: purchase cost of a 90 H.P. tractor, less salvation value, divided by 10 years. Tractor is used 500 hours a year. Purchase cost: $95,128."]
["   par 10 ans. Le tracteur est utilisé 500 heures par an. Coût du tracteur: 95 128 $"]
["Commentaires:","Comments:"]
["   Il en coûte environ 2 750 $/an pour déneiger les alentours d'une porcherie et son chemin d'accès","   Costs associated with removing snow around a hog house and its access roads are approximately $2,750/year."]
[]
[]
["Calcul du rendement en bois"]
["Français","Anglais"]
["Rendement en bois","Wood yields"]
["Période","Period"]
["Améliorations","Improvements in incomes"]
["Détériorations","Decreases in incomes"]
["Marge","Margin (improvements-decreases)"]
["Marge actualisée ","Discounted margin"]
["Marge actualisée cumulative","Cumulative discounted margin"]
["0-5 ans","0-5 years"]
["5-10 ans","5-10 years"]
["10-20 ans","10-20 years"]
["20-40 ans","20-40 years"]
[]
["Conservateur (avec prix au plus bas)et réaliste (avec prix au plus haut) avec du bois de sciage et de chauffage, optimiste (avec prix au plus haut) avec du bois de déroulage et de chauffage","Conservative: lower price for heating wood and lumber; realistic: highest price for heating wood and lumber; optimistic: highest price for rotary cutting and heating. "]
["Nombre de m3 à maturité","Number of m3 at maturity"]
["Valeur si le bois est vendu pour le sciage","Value when sold for timber"]
["Valeur si le bois est vendu pour le déroulage","Value when sold for rotary cutting"]
["Valeur si le bois est vendu pour du bois de chauffage","Value when sold for heating"]
["Valeur de la biomasse brut (pâte ou autres destinations)","Value of total biomass (pulp or other purposes)"]
["Corde de 4'","4-foot cord"]
["/tonne M.S. ou /m3","/ton of D.M. or /m3"]
["Épinettes, Pins ou Thuyas","Spruce, pine, cedar"]
["Peupliers hybrides","Hybrid poplars"]
["Feuillus nobles","Hardwoods"]
["Saules hybrides (tonne M.S.)","Hybrid willows (ton of D.M."]
["Références: Michel  Labrecque communication personnelle voir CEPAF/colloque/conférence BR","References: Michel  Labrecque, personal communication (CEPAF/colloque/conférence BR)"]
[]
["Nombre total de végétaux ","Total number of plants"]
["Nombre d'arbres requis pour faire 1 m3","Number of trees needed to render 1 m3 of wood"]
["Nombre de m3 à maturité","Number of m3 at maturity"]
["Essences","Species"]
["Épinettes, Pins ou Thuyas","Spruce, pine, cedar"]
["Peupliers hybrides","Hybrid poplars"]
["Feuillus nobles","Hardwoods"]
["Saules hybrides","Hybrid willows"]
["CON","CON"]
["PEH","HPO"]
["FNO","HWD"]
["SAH","HWL"]
["Nombre d'arbres requis pour faire 1 tonne M.S./an","Number of trees needed to render 1 ton of D.M/year"]
[]
["Type de bois","Type of wood"]
["Sciage","Lumber"]
["Bois de chauffage","Heating"]
["déroulage","Rotary cutting"]
["Pâte ou biomasse","Pulp & biomass"]
["Choix","Select"]
["PEH","HPO"]
["CON","CON"]
["FNO","HWD"]
["SAH","HWL"]
["Sciage","Lumber"]
["Pâte ou biomasse","Pulp & biomass"]
["Saules","Willows"]
["Rendement tonne M.S./ha/an ","Yield (ton of D.M./ha/year)"]
["Espacement entre les tiges","Spacing between branches"]
["Espacement entre les rangs","Spacing between rows"]
["Tiges / tonne","Branches/ton"]
[]
["Arbre entier","Entire tree "]
["Bille seulement","Logs only"]
["Volume marchand FNO","Volume marchand FNO"]
["Volume marchand CON","Volume marchand CON"]
["Les dimensions considérées pour la coupe des FNO sont 40 cm DHS, 36 cm au fin bout, 3 m de bille. Le cubage total vient de la moyenne de différents feuillus nobles extrait de \"Metric timber tables for the commercial tree species of Central and Eastern Canada\" publié par le Service canadien des forêts en 1983 pour des arbres de 18 m avec un DBHOB de 42 cm, soit un diamètre d'environ 1cm/an et une hauteur d'environ 0,5 m/an, ce qui correspond aux relevés sur le terrain de 2006.","Dimensions used for HWD is: 40 cm dsh, 36 cm at the tip and 3-m logs. Total scale is the average from various hardwoods as listed in the \"Metric timber tables for the Commercial tree species of central and eastern Canada\" published by the Canadian Forest Service in 1983 for trees measuring 18 metres with a DBHOB of 42 cm, i.e., with a diameter of approximately 1 cm/year and a height of approximately 0.5 m/year, which is consistent with the 2006 census. "]
["Dans le cas des PEH, seul le volume des billes a été considéré.","In the case of hybrid poplars, only log volumes are used."]
["Le volume de bois de chauffage considéré dans les houppiers correspond à la différence entre le cubage total et celui de la bille.1 corde de 4X4X8 = 3.625 m3 apparent. 1 m3 de bois dur = 1.81 m3 apparent.","Heating wood volumes calculated at crown is: total scale less log scale. One cord (4X4X8) = 3.625 m3 (apparent). One cubic metre (m3) of hardwood = 1.81 m3 (apparent)"]
["Les dimensions considérées pour la coupe des CON sont 40 cm DHS, 36 cm au fin bout, 3 m de bille. Le cubage total vient de la moyenne de différents conifères extrait de  \"Metric timber tables for the commercial tree species of Central and Eastern Canada\" publié par le Service canadien des forêts en 1983 pour des arbres de 18 m avec un DBHOB de 42 cm, soit un diamètre d'environ 1cm/an et une hauteur d'environ 0,5 m/an, ce qui correspond aux relevés sur le terrain de 2006.","Dimensions used for CON is: 40 cm dsh, 36 cm at the tip and 3-m logs. Total scale is the average from various conifers as listed in the \"Metric timber tables for the Commercial tree species of central and eastern Canada\" published by the Canadian Forest Service in 1983 for trees measuring 18 metres with a DBHOB of 42 cm, i.e., with a diameter of approximately 1 cm/year and a height of approximately 0.5 m/year, which is consistent with the 2006 census. "]
["m3/arbre","m3/tree"]
["m3/arbre","m3/tree"]
["\\Prixmoyenboishaiebriseodeur.xls","\\Prixmoyenboishaiebriseodeur.xls"]
["\\rendements brise-vent.xls","\\rendements brise-vent.xls"]
["\\84_Cubage_bois_abattus_SB011999.pdf","\\84_Cubage_bois_abattus_SB011999.pdf"]
["\\boischauffageMonteregie.pdf","\\boischauffageMonteregie.pdf"]
["CER","CER"]
["ERA","ERA"]
["TIL","TIL"]
["CHR","CHR"]
["HET","HET"]
["ORM","ORM"]
["PIB","PIB"]
["PIR","PIR"]
["EPR","EPR"]
["EPB","EPB"]
["THU","THU"]
["moyenne"]
[]
["Amélioration","Costs calculation based on inflation and interest rates"]
["Marge actualisée","Calculation of discounted value of dollar"]
["Marge actualisée accumulée","Margin updated accumulated"]
["total cumulatif à l'an","Cumulative total per year"]
[]
[]
["Calcul du rendement en petits fruits"]
["Français","Anglais"]
["Rendement en petits fruits ( les données considérées font références au sureau blanc )","Small fruit yield (data indicated refers to common elderberry) "]
["Période","Period"]
["Améliorations","Improvements in incomes"]
["Détériorations","Decreases in incomes"]
["Marge","Margin (improvements-decreases)"]
["Marge actualisée ","Discounted margin"]
["Marge actualisée cumulative","Cumulative discounted margin"]
["0-5 ans","0-5 years"]
["5-10 ans","5-10 years"]
["10-20 ans","10-20 years"]
["20-40 ans","20-40 years"]
[]
["Revenus liés aux PFNL de 0 à 5 ans","PFNL revenues from 0-5 years"]
["Revenus liés aux PFNL de 5 à 10 ans","PFNL revenues from 5-10 years"]
["Revenus liés aux PFNL de 10 à 20 ans","PFNL revenues from 10-20 years"]
["Revenus liés aux PFNL de 20 à 40 ans","PFNL revenues from 20-40 years"]
[]
["Pourcentage de profit net anticipé ?","Net profit expected (%)?"]
["Récolte par tige","Harvest per branch"]
["Prix la tonne","Price per ton"]
["Pourcentage en arbustes fruitier","Percentage of fruit bushes"]
["Les fruits seront récoltés","Fruit will be harvested"]
["Conservateur sans petits fruits, réaliste avec petits fruits,4 kg/tige, $800/tonne et 5% de profit net; optimiste avec petits fruits, 6 kg/, $1000/tonne et 10% de profit net","Conservative: no fruit. Realistic: 4 kg/branch, $800/ton, and 5% net profit. Optimistic: 6 kg/branch, $1,000/ton, and 10% net profit. "]
["Facteur égal à 0 s'il n'y a pas de récolte et égal à 1 s'il y à une récolte","Multiplication factor: 0 when there is no harvest; 1 when a harvest is expected. "]
[]
["Amélioration","Costs calculation based on inflation and interest rates"]
["Marge actualisée","Calculation of discounted value of dollar"]
["Marge actualisée accumulée","Margin updated accumulated"]
["total cumulatif à l'an","Cumulative total per year"]
[]
[]
["Amélioration de rendement"]
["Français","Anglais"]
["Amélioration de rendement","Yield improvements"]
["Période","Period"]
["Améliorations","Improvements in incomes"]
["Détériorations","Decreases in incomes"]
["Marge","Margin (improvements-decreases)"]
["Marge actualisée ","Discounted margin"]
["Marge actualisée cumulative","Cumulative discounted margin"]
["0-5 ans","0-5 years"]
["5-10 ans","5-10 years"]
["10-20 ans","10-20 years"]
["20-40 ans","20-40 years"]
[]
["Rangée 1","Row 1"]
["Rangée 2","Row 2"]
["Rangée 3","Row 3"]
["Haie","Hedge"]
["Croissance annuelle","Annual growth"]
["Hauteur maximale de la haie","Maximum height of hedge"]
["Protection de culture","Crop protection"]
[]
["Longueur de la protection","Length of protection"]
["Rotation sur combien d'année ?","Rotation over how many years?"]
["Choix de rotation","Rotation"]
["Culture","Crop"]
["Marge produits sur investissement /ha","Margin or return on investment/ha"]
["Année de référence","Reference year"]
["Marge produits sur débours /ha","Margin (return on expenditures)/ha"]
["Marge moyenne des produits sur débours   /ha","Average margin of return on expenditures/ha"]
[]
["Amélioration","Costs calculation based on inflation and interest rates"]
["Marge actualisée","Calculation of discounted value of dollar"]
["Marge actualisée accumulée","Margin updated accumulated"]
["total cumulatif à l'an","Cumulative total per year"]
[]
["hauteur de la haie selon les années","height of the hedge depending on the year"]
["année","year"]
["hauteur","height"]
["ajusté en fonction de la récolte des PEH à 20 ans et la présence de FNO ou CON","adjusted for the harvesting of PEH in 20 years and the presence of FNO or CON"]
[]
[]
["Pertes de sol"]
["Français","Anglais"]
["Pertes de sol","Soil losses"]
["Période","Period"]
["Améliorations","Improvements in incomes"]
["Détériorations","Decreases in incomes"]
["Marge","Margin (improvements-decreases)"]
["Marge actualisée ","Discounted margin"]
["Marge actualisée cumulative","Cumulative discounted margin"]
["0-5 ans","0-5 years"]
["5-10 ans","5-10 years"]
["10-20 ans","10-20 years"]
["20-40 ans","20-40 years",null,"CON"]
[null,null,null,"CON"]
["Rangée 1","Row 1",null,"CON"]
["Rangée 2","Row 2"]
["Rangée 3","Row 3"]
["Croissance annuelle","Annual growth"]
["Hauteur maximale de la haie","Maximum height of hedge"]
["Protection de culture","Crop protection"]
["Valeur ($/ha/année)","Value ($/ha/year)"]
["Longueur de la protection","Length of protection"]
["Perte de sol annuelle (mm)","Annual soil losses (mm)"]
[]
["Facteur de multiplication qui vaut 1 lorsqu'il y a une protection de culture et vaut 0 lorsqu'il n'y en n'a pas","Multiplication factor: 1 when crops are protected; 0 if crops are not protected"]
[]
["Amélioration","Costs calculation based on inflation and interest rates"]
["Marge actualisée","Calculation of discounted value of dollar"]
["Marge actualisée accumulée","Margin updated accumulated"]
["total cumulatif à l'an","Cumulative total per year"]
[]
[]
["Crédits carbone"]
["Français","Anglais"]
["Crédits carbone","Carbon credits"]
["Période","Period"]
["Améliorations","Improvements in incomes"]
["Détériorations","Decreases in incomes"]
["Marge","Margin (improvements-decreases)"]
["Marge actualisée ","Discounted margin"]
["Marge actualisée cumulative","Cumulative discounted margin"]
["0-5 ans","0-5 years"]
["5-10 ans","5-10 years"]
["10-20 ans","10-20 years"]
["20-40 ans","20-40 years"]
[]
["CO2 (kg/ha) = [(Biomasse totale (m3/ha) * Densité anhydre du bois (kg sec/m3))* Carbone/mat sec (kg/kg)] * CO2/Carbone (kg/kg)]+  [C contenu dans la litière et le bois mort (kg/ha)( la litière n'est pas tenu en compte dans notre calcul)]","CO2 (kg/ha) = [(Total biomass (m3/ha) * Oven-dry wood density (kg/m3))* Carbon/dry matter (kg/kg)] * CO2/Carbon (kg/kg)]+  [C content in litter and dead wood (kg/ha) (litter has not been included in our calculations)]"]
[]
["Calcul du volume de bois","Wood volume calculation"]
["Calcul de la matière sèche","Dry matter calculation"]
["Volume marchand","Merchantable volume"]
["Facteur de conversion pour la biomasse total","Total biomass conversion ratio"]
["Densité anhydre du bois (kg/m3)","Oven-dry wood density (kg/m3)"]
["Matière sèche total (tonne)","Total dry matter (ton)"]
["biomasse totale ","Total biomass"]
["Taux de conversion total ajusté à 1.6 ( Pajot à 1.6 et logiciel TimberCAM à 1.63 de moyenne entre bois dur et bois mou)","Adjusted conversion ratio at 1.6 ( Pajot is 1.6; TimberCAM software is 1.63, average between hardwood and softwood)."]
["Référence TimberCAM bois mou","Reference: TimberCAM softwood"]
["Référence Jean Nolet communication personnelle voir: G:\\CEPAF\\Logiciel d'analyse économique\\Références\\Séquestration de carbone\\Rapport final_mars 2007","Reference: Jean Nolet, personal communication (G:\\CEPAF\\Logiciel d'analyse économique\\Références\\Séquestration de carbon\\Rapport final_mars 2007)"]
["Référence TimberCAM bois dur","Reference: TimberCAM hardwood"]
["30 ans de récolte","30 years of harvest"]
["À la récolte","At harvest"]
["Références: Michel  Labrecque communication personnelle voir C:\\Documents and Settings\\Christian Rivest\\Mes documents\\Christian\\CEPAF\\Colloque\\conférence BR\\RE revenu du saule par tonne de matière sèche","Reference: Michel  Labrecque, personal communication (C:\\Documents and Settings\\Christian Rivest\\Mes documents\\Christian\\CEPAF\\Colloque\\ conférence BR\\RE revenu du saule par tonne de matière sèche)"]
[]
["Calcul du contenu en carbone de la masse anhydre ","Calculation of carbon content in oven-dry mass"]
["Pour la biomasse totale","For total biomass"]
["Calcul de l'équivalent en tonne de CO2/ tonne de C","Calculation of equivalent in tons of CO2/ ton of C"]
["Pourcentage de C/tonne de matière sèche","% of C/ton of dry matter"]
["Facteur de conversion","Conversion ratio"]
["Contenu en C (tonne)","C content (ton)"]
["Contenu en CO2 (tonne)","CO2 content (ton)"]
[]
["Amélioration","Costs calculation based on inflation and interest rates"]
["Marge actualisée","Calculation of discounted value of dollar"]
["Marge actualisée accumulée","Margin updated accumulated"]
["total cumulatif à l'an","Cumulative total per year"]
[]
[]
["Tableau synthèse"]
["Français","Anglais"]
["Nombre de rangées","Number of rows"]
["Espèces d'arbres","Species"]
["Marge cumulative actualisée après 5 ans ($)","Cumulative discounted margin after 5 years ($)"]
["Marge cumulative actualisée après 10 ans ($)","Cumulative discounted margin after 10 years ($)"]
["Marge cumulative actualisée après 20 ans ($)","Cumulative discounted margin after 20 years ($)"]
["Marge cumulative actualisée après 40 ans ($)","Cumulative discounted margin after 40 years ($)"]
["Délai de récupération (années)","Payback period (years)"]
[]
["Arbustes fruitiers","Fruit bushes"]
["Feuillus nobles","Hardwoods"]
["Feuillus nobles et arbustes","Hardwoods and shrubs"]
["Peupliers hybrides et feuillus nobles","Hybrid poplars and shrubs"]
["Saules hybrides","Hybrid willows"]
["Peupliers hybrides","Hybrid poplars and shrubs"]
[" + de 40 ans","over 40 years"]
["Résultats de simulation en cours","Simulation results in progress"]
[]
["Bilan carbone"]
["Français","Anglais"]
["Carbone séquestré (tonnes de CO² équivalent) après 40 ans","Carbon sequestered (ton CO² equivalent) after 40 years"]
["Type de haie:","Hedge type:"]
["Rangée 1","Row 1"]
["Rangée 2","Row 2"]
["Rangée 3","Row 3"]
["Rangée 4","Row 4"]
["Rangée 5","Row 5"]
["Rangée 6","Row 6"]
["Rangée 7","Row 7"]
["Total Tonnes de CO2","Total ton CO2"]
[]
["*Pour le PEH, la valeur de CO2-C indiquer comprend la valeur à 20 ans si il y a eu récolte ou à 40 ans si pas de récolte à 20 ans","*For hybrid poplar,CO2-C value correspond to the value at 20 years if it was harvested or the value at 40 years if not harvested"]
["**Pour les arbustes, la valeur de CO2-C indiquer comprend la valeur à 10 ans","*For shrubs,CO2-C value correspond to the value at 10 years."]
["Crédits carbone","Carbon credits"]
["Prix de la réduction d’une tonne des GES :","Estimated value of GHG reductions per ton : "]
["/tonne CO2","/ton CO2"]
["Arbres","Trees"]
["Résineux","Conifers"]
["Feuillus nobles","Hardwoods"]
["Peupliers hybrides*","Hybrid poplars"]
["Arbustes","Shrubs"]
["Saules hybrides","Hybrid willows"]
["Arbustes**","Shrubs**"]
[]
["pour la protection de culture","Crop protection"]
["pour la protection de bâtiment et de route","Building and road protection"]
["pour bande riveraine","Riparian buffer strip"]
["Massifs de saules pour la production de biomasse","Willow Short-Rotation Coppice for biomass"]

{"sheet":"Menu principal","index":3,"n_rows":133,"n_cols":6,"rows_kept":133,"cut":false,"hidden":false,"merged":[[39,4,39,5],[26,2,26,7],[3,2,4,7],[5,2,6,7],[1,1,1,8],[2,1,2,8],[24,2,24,7],[25,2,25,7]]}
[]
[null,{"$f":"IF(Langue!A200 = \"FR\",Dictionnaire!A111,Dictionnaire!B111)","v":"Outil de simulation des impacts économiques "}]
[null,{"$f":"IF(Langue!$A$200 = \"FR\",Dictionnaire!A112,Dictionnaire!B112)","v":"de pratiques agroforestières"}]
[null,null,{"$f":"IF(Langue!$A$200 = \"FR\",Dictionnaire!A113,Dictionnaire!B113)","v":"Ce programme de simulation a été conçu pour faciliter la prise de décision lors de l'établissement de haies brise-vent, de bandes riveraines boisées ou de massifs de saule. "}]
[]
[null,null,{"$f":"IF(Langue!$A$200 = \"FR\",Dictionnaire!A114,Dictionnaire!B114)","v":"Dans le cas d'une première utilisation, il est conseillé de consulter les rubriques \"Instructions\" et \"Paramètres économiques\" avant de commencer. "}]
[]
[]
[]
[]
[]
[]
[]
[]
[]
[]
[]
[]
[]
[]
[]
[]
[]
[]
[null,null,"IMPORTANT"]
[null,null,{"$f":"IF(Langue!$A$200 = \"FR\",Dictionnaire!A115,Dictionnaire!B115)","v":"Pour débloquer les macros, veuillez enregistrer le fichier sur votre disque dur et cliquer sur le lien ci-dessous pour la procédure."}]
[null,null,{"$f":"IF(Langue!$A$200 = \"FR\",Dictionnaire!A116,Dictionnaire!B116)","v":"Débloquer les macros (Microsoft)"}]
[]
[]
[]
[]
[]
[]
[]
[]
[]
[]
[]
[]
[null,null,null,null,{"$f":"IF(Langue!$A$200 = \"FR\",Dictionnaire!A117,Dictionnaire!B117)","v":"Révisé février 2024"}]
[]
[]
[]
[]
[]
[]
[]
[]
[]
[]
[]
[]
[]
[]
[]
[]
[]
[]
[]
[]
[]
[]
[]
[]
[]
[]
[]
[]
[]
[]
[]
[]
[]
[]
[]
[]
[]
[]
[]
[]
[]
[]
[]
[]
[]
[]
[]
[]
[]
[]
[]
[]
[]
[]
[]
[]
[]
[]
[]
[]
[]
[]
[]
[]
[]
[]
[]
[]
[]
[]
[]
[]
[]
[]
[]
[]
[]
[]
[]
[]
[]
[]
[]
[]
[]
[]
[]
[]
[null,null,null,null,null,1.25]
[]
[null,null,null,null,null,2]
[]
[null,null,null,null,null,0.2]

{"sheet":"Instructions","index":4,"n_rows":2,"n_cols":2,"rows_kept":2,"cut":false,"hidden":false,"merged":[[1,1,1,8],[4,1,4,8]]}
[]
[null,"Instructions"]

{"sheet":"Paramètres","index":5,"n_rows":200,"n_cols":34,"rows_kept":200,"cut":false,"hidden":false,"merged":[[13,23,19,23],[104,18,106,21],[54,18,55,21],[45,18,46,21],[45,1,46,4],[54,1,55,4],[104,1,106,4],[67,5,67,6],[68,5,68,6],[63,5,63,6],[64,5,64,6],[63,7,63,8],[64,7,64,8],[65,7,65,8],[66,7,66,8],[104,11,105,11],[104,12,105,12],[69,5,69,6],[69,7,69,8],[54,22,54,23],[77,20,80,21],[49,5,49,6],[50,7,50,8],[51,7,51,8],[116,22,116,23],[116,24,116,25],[117,22,117,23],[117,24,117,25],[113,22,113,23],[113,24,113,25],[114,18,115,21],[72,24,72,26],[72,7,72,9],[114,22,114,23],[114,24,114,25],[115,22,115,23],[115,24,115,25],[77,18,78,19],[81,20,81,21],[82,20,82,21],[83,20,83,21],[84,20,84,21],[116,7,116,8],[118,22,118,23],[118,24,118,25],[119,22,119,23],[119,24,119,25],[122,22,122,23],[122,24,122,25],[123,22,123,23],[123,24,123,25],[120,22,120,23],[120,24,120,25],[121,22,121,23],[121,24,121,25],[71,24,71,25],[69,24,69,25],[77,24,79,24],[77,25,79,25],[112,22,112,23],[112,24,112,25],[109,22,109,23],[109,24,109,25],[110,22,110,23],[110,24,110,25],[104,22,105,23],[104,24,105,25],[106,22,106,23],[106,24,106,25],[111,22,111,23],[111,24,111,25],[107,22,107,23],[107,24,107,25],[108,22,108,23],[108,24,108,25],[87,23,97,25],[77,22,79,22],[77,23,79,23],[70,22,70,23],[60,24,60,25],[61,22,61,23],[61,24,61,25],[58,22,58,23],[58,24,58,25],[59,22,59,23],[59,24,59,25],[60,22,60,23],[62,24,62,25],[70,24,70,25],[63,22,63,23],[63,24,63,25],[64,22,64,23],[64,24,64,25],[67,22,67,23],[67,24,67,25],[62,22,62,23],[65,22,65,23],[65,24,65,25],[66,22,66,23],[66,24,66,25],[68,24,68,25],[69,22,69,23],[68,22,68,23],[56,24,56,25],[57,22,57,23],[57,24,57,25],[54,24,54,25],[55,22,55,23],[55,24,55,25],[56,22,56,23],[49,22,49,23],[45,22,46,23],[45,24,46,25],[47,22,47,23],[47,24,47,25],[48,22,48,23],[48,24,48,25],[49,24,49,25],[53,22,53,23],[53,24,53,25],[51,24,51,25],[51,22,51,23],[52,22,52,23],[52,24,52,25],[50,22,50,23],[50,24,50,25],[114,1,115,4],[81,3,81,4],[114,5,114,6],[115,5,115,6],[82,3,82,4],[83,3,83,4],[84,3,84,4],[111,5,111,6],[109,5,109,6],[106,5,106,6],[87,6,97,8],[107,7,107,8],[109,7,109,8],[108,7,108,8],[112,5,112,6],[77,6,79,6],[77,5,79,5],[47,5,47,6],[52,7,52,8],[53,5,53,6],[48,7,48,8],[48,5,48,6],[57,5,57,6],[50,5,50,6],[51,5,51,6],[61,5,61,6],[49,7,49,8],[54,5,54,6],[55,5,55,6],[53,7,53,8],[52,5,52,6],[58,7,58,8],[59,7,59,8],[56,7,56,8],[61,7,61,8],[60,5,60,6],[60,7,60,8],[58,5,58,6],[59,5,59,6],[1,1,1,8],[45,7,46,8],[45,5,46,6],[7,1,8,8],[13,6,19,6],[5,1,6,8],[11,7,11,10],[47,7,47,8],[77,1,78,2],[71,7,71,8],[71,5,71,6],[70,5,70,6],[77,8,79,8],[77,7,79,7],[55,7,55,8],[54,7,54,8],[67,7,67,8],[68,7,68,8],[65,5,65,6],[66,5,66,6],[77,3,80,4],[62,5,62,6],[70,7,70,8],[62,7,62,8],[56,5,56,6],[57,7,57,8],[71,22,71,23],[122,5,122,6],[104,5,105,6],[110,7,110,8],[111,7,111,8],[121,5,121,6],[120,5,120,6],[114,7,114,8],[117,7,117,8],[117,5,117,6],[112,7,112,8],[113,7,113,8],[107,5,107,6],[110,5,110,6],[108,5,108,6],[113,5,113,6],[119,7,119,8],[118,7,118,8],[118,5,118,6],[104,7,105,8],[106,7,106,8],[119,5,119,6],[116,5,116,6],[125,24,125,25],[129,5,129,6],[129,22,129,23],[115,7,115,8],[130,5,130,6],[128,5,128,6],[125,5,125,6],[126,5,126,6],[127,5,127,6],[125,7,125,8],[125,22,125,23],[126,22,126,23],[126,24,126,25],[127,22,127,23],[127,24,127,25],[120,7,120,8],[121,7,121,8],[122,7,122,8],[126,7,126,8],[127,7,127,8],[123,7,123,8],[124,7,124,8],[124,5,124,6],[131,24,131,26],[131,7,131,9],[123,5,123,6],[128,7,128,8],[129,7,129,8],[130,7,130,8],[128,22,128,23],[128,24,128,25],[129,24,129,25],[130,22,130,23],[130,24,130,25],[124,22,124,23],[124,24,124,25]]}
[]
[null,{"$f":"IF(Langue!A200 = \"FR\",Dictionnaire!A3,Dictionnaire!B3)","v":"Paramètres"}]
[]
[]
[]
[null,"IMPORTANT"]
[]
[null,{"$f":"IF(Langue!A200 = \"FR\",Dictionnaire!A5,Dictionnaire!B5)","v":"Les informations ci-dessous sont utilisées lors des calculs mais elles ne sont pas remises à zéro lors d'une nouvelle simulation. Ces informations peuvent être modifiées et doivent être mises à jour régulièrement.  Elles peuvent être remises leur valeur par défaut en cliquant sur le bouton \"Paramètres par défaut\" ci-dessus."}]
[]
[]
[]
[]
[]
[null,{"$f":"IF(Langue!$A$200 = \"FR\",Dictionnaire!$A7,Dictionnaire!$B7)","v":"Taux d'actualisation annuel ? (valeur calculée, ne pas modifier)"},null,null,null,null,null,null,{"$f":"Questionnaire!#REF!","v":{"$error":"#REF!"}},null,null,null,null,null,null,null,null,null,{"$f":"IF(Langue!$A$200 = \"FR\",Dictionnaire!$A7,Dictionnaire!$B7)","v":"Taux d'actualisation annuel ? (valeur calculée, ne pas modifier)"},null,null,null,null,null,null,{"$f":"Questionnaire!E14","v":0.06},null,null,"Taux d'actualisation annuel ",null,null,{"$f":"Z14","v":0.06},null,"Fred a demandé de mettre 6% par défaut dans le questionnaire tout simplement (2022-07-14)"]
[]
[null,"Taux d'intérêt perçu sur les placements ?",null,null,null,null,null,null,{"$f":"AE16","v":0},null,null,null,null,null,null,null,null,null,"Taux d'intérêt perçu sur les placements ?",null,null,null,null,null,null,{"$f":"AV16","v":0},null,null,"Taux d'intérêt perçu sur les placements",null,0,{"$f":"AE16/10000","v":0},null,"F:\\CEPAF\\Logiciel d'analyse économique\\Références\\Banque du Canada\\Calcul des taux moyens"]
[]
[null,"Taux d'intérêt payé sur les emprunts ?",null,null,null,null,null,null,{"$f":"AE18","v":0},null,null,null,null,null,null,null,null,null,"Taux d'intérêt payé sur les emprunts ?",null,null,null,null,null,null,{"$f":"AV18","v":0},null,null,"Taux d'intérêt payé sur les emprunts",null,0,{"$f":"AE18/10000","v":0},null,"F:\\CEPAF\\Logiciel d'analyse économique\\Références\\Banque du Canada\\Calcul des taux moyens"]
[]
[null,{"$f":"IF(Langue!$A$200 = \"FR\",Dictionnaire!$A8,Dictionnaire!$B8)","v":"Taux d'inflation annuel ? (utiliser les flèches pour modifier le pourcentage)"},null,null,null,null,null,null,{"$f":"$AF20","v":0.02},null,null,null,null,null,null,null,null,null,{"$f":"IF(Langue!$A$200 = \"FR\",Dictionnaire!$A8,Dictionnaire!$B8)","v":"Taux d'inflation annuel ? (utiliser les flèches pour modifier le pourcentage)"},null,null,null,null,null,null,{"$f":"$AF20","v":0.02},null,null,"Taux d'inflation annuel",0.02,200,{"$f":"AE20/10000","v":0.02},null,"F:\\CEPAF\\Logiciel d'analyse économique\\Références\\Banque du Canada\\Calcul des taux moyens"]
[]
[]
[]
[null,{"$f":"IF(Langue!$A$200 = \"FR\",Dictionnaire!$A11,Dictionnaire!$B11)","v":"Rouleau de pailllis de plastique de 1,2 ou 1,5 m de large"},null,null,null,null,null,null,225,null,null,null,null,null,null,null,null,null,{"$f":"IF(Langue!$A$200 = \"FR\",Dictionnaire!$A11,Dictionnaire!$B11)","v":"Rouleau de pailllis de plastique de 1,2 ou 1,5 m de large"},null,null,null,null,null,null,225]
[null,{"$f":"IF(Langue!$A$200 = \"FR\",Dictionnaire!$A12,Dictionnaire!$B12)","v":"Petite collerette (30 cm X 30 cm)"},null,null,null,2,{"$f":"IF(Langue!$A$200 = \"FR\",Dictionnaire!$A16,Dictionnaire!$B16)","v":"broches/collerette"},null,0.63,null,null,null,null,null,null,null,null,null,{"$f":"IF(Langue!$A$200 = \"FR\",Dictionnaire!$A12,Dictionnaire!$B12)","v":"Petite collerette (30 cm X 30 cm)"},null,null,null,2,{"$f":"IF(Langue!$A$200 = \"FR\",Dictionnaire!$A16,Dictionnaire!$B16)","v":"broches/collerette"},null,0.63]
[null,{"$f":"IF(Langue!$A$200 = \"FR\",Dictionnaire!$A13,Dictionnaire!$B13)","v":"Grande collerette (1 m X 1 m)"},null,null,null,9,{"$f":"IF(Langue!$A$200 = \"FR\",Dictionnaire!$A16,Dictionnaire!$B16)","v":"broches/collerette"},null,2,null,null,null,null,null,null,null,null,null,{"$f":"IF(Langue!$A$200 = \"FR\",Dictionnaire!$A13,Dictionnaire!$B13)","v":"Grande collerette (1 m X 1 m)"},null,null,null,9,{"$f":"IF(Langue!$A$200 = \"FR\",Dictionnaire!$A16,Dictionnaire!$B16)","v":"broches/collerette"},null,2]
[null,{"$f":"IF(Langue!$A$200 = \"FR\",Dictionnaire!$A14,Dictionnaire!$B14)","v":"Biodisque (60 cm)"},null,null,null,5,{"$f":"IF(Langue!$A$200 = \"FR\",Dictionnaire!$A16,Dictionnaire!$B16)","v":"broches/collerette"},null,2,null,null,null,null,null,null,null,null,null,{"$f":"IF(Langue!$A$200 = \"FR\",Dictionnaire!$A14,Dictionnaire!$B14)","v":"Biodisque (60 cm)"},null,null,null,5,{"$f":"IF(Langue!$A$200 = \"FR\",Dictionnaire!$A16,Dictionnaire!$B16)","v":"broches/collerette"},null,2]
[null,{"$f":"IF(Langue!$A$200 = \"FR\",Dictionnaire!$A15,Dictionnaire!$B15)","v":"Broches servant à fixer les collerettes"},null,null,null,null,null,null,0.23,null,null,null,null,null,null,null,null,null,{"$f":"IF(Langue!$A$200 = \"FR\",Dictionnaire!$A15,Dictionnaire!$B15)","v":"Broches servant à fixer les collerettes"},null,null,null,null,null,null,0.23]
[null,{"$f":"IF(Langue!$A$200 = \"FR\",Dictionnaire!$A17,Dictionnaire!$B17)","v":"Taux horaire pour la main d'œuvre lors de l'établissement et l'entretien de la haie ($/h)"},null,null,null,null,null,null,35,null,null,null,null,null,null,null,null,null,{"$f":"IF(Langue!$A$200 = \"FR\",Dictionnaire!$A17,Dictionnaire!$B17)","v":"Taux horaire pour la main d'œuvre lors de l'établissement et l'entretien de la haie ($/h)"},null,null,null,null,null,null,35]
[null,{"$f":"IF(Langue!$A$200 = \"FR\",Dictionnaire!$A18,Dictionnaire!$B18)","v":"Frais de déplacement ($/km)"},null,null,null,null,null,null,0.5,null,null,null,null,null,null,null,null,null,{"$f":"IF(Langue!$A$200 = \"FR\",Dictionnaire!$A18,Dictionnaire!$B18)","v":"Frais de déplacement ($/km)"},null,null,null,null,null,null,0.5]
[null,{"$f":"IF(Langue!$A$200 = \"FR\",Dictionnaire!$A19,Dictionnaire!$B19)","v":"Taux horaire pour les travaux mécaniques de préparation du sol ($/h)"},null,null,null,null,null,null,150,null,null,null,null,null,null,null,null,null,{"$f":"IF(Langue!$A$200 = \"FR\",Dictionnaire!$A19,Dictionnaire!$B19)","v":"Taux horaire pour les travaux mécaniques de préparation du sol ($/h)"},null,null,null,null,null,null,150]
[null,{"$f":"IF(Langue!$A$200 = \"FR\",Dictionnaire!$A20,Dictionnaire!$B20)","v":"Plans et devis (montant forfaitaire)"},null,null,null,null,null,null,800,null,null,null,null,null,null,null,null,null,{"$f":"IF(Langue!$A$200 = \"FR\",Dictionnaire!$A20,Dictionnaire!$B20)","v":"Plans et devis (montant forfaitaire)"},null,null,null,null,null,null,800]
[]
[]
[]
[null,{"$f":"IF(Langue!$A$200 = \"FR\",Dictionnaire!$A23,Dictionnaire!$B23)","v":"Taux de mortalité anticipé la première année suivant la plantation"},null,null,null,null,null,null,0.05,null,null,null,null,null,null,null,null,null,{"$f":"IF(Langue!$A$200 = \"FR\",Dictionnaire!$A23,Dictionnaire!$B23)","v":"Taux de mortalité anticipé la première année suivant la plantation"},null,null,null,null,null,null,0.05]
[null,{"$f":"IF(Langue!$A$200 = \"FR\",Dictionnaire!$A24,Dictionnaire!$B24)","v":"Taux horaire (machinerie et main d'œuvre) pour le fauchage et l'inspection phytosanitaire ($/h)"},null,null,null,null,null,null,45,null,null,null,null,null,null,null,null,null,{"$f":"IF(Langue!$A$200 = \"FR\",Dictionnaire!$A24,Dictionnaire!$B24)","v":"Taux horaire (machinerie et main d'œuvre) pour le fauchage et l'inspection phytosanitaire ($/h)"},null,null,null,null,null,null,45]
[null,{"$f":"IF(Langue!$A$200 = \"FR\",Dictionnaire!$A25,Dictionnaire!$B25)","v":"Taux horaire (machinerie et main d'œuvre) pour la taille de formation et l'élagage"},null,null,null,null,null,null,75,null,null,null,null,null,null,null,null,null,{"$f":"IF(Langue!$A$200 = \"FR\",Dictionnaire!$A25,Dictionnaire!$B25)","v":"Taux horaire (machinerie et main d'œuvre) pour la taille de formation et l'élagage"},null,null,null,null,null,null,75]
[null,{"$f":"IF(Langue!$A$200 = \"FR\",Dictionnaire!$A26,Dictionnaire!$B26)","v":"Nombre de fauchages par année"},null,null,null,null,null,null,2,null,null,null,null,null,null,null,null,null,{"$f":"IF(Langue!$A$200 = \"FR\",Dictionnaire!$A26,Dictionnaire!$B26)","v":"Nombre de fauchages par année"},null,null,null,null,null,null,2]
[null,{"$f":"IF(Langue!$A$200 = \"FR\",Dictionnaire!$A27,Dictionnaire!$B27)","v":"Frais de déplacement avec la machinerie ($/km)"},null,null,null,null,null,null,0.7,null,null,null,null,null,null,null,null,null,{"$f":"IF(Langue!$A$200 = \"FR\",Dictionnaire!$A27,Dictionnaire!$B27)","v":"Frais de déplacement avec la machinerie ($/km)"},null,null,null,null,null,null,0.7]
[null,{"$f":"IF(Langue!$A$200 = \"FR\",Dictionnaire!$A28,Dictionnaire!$B28)","v":"Spirale de protection contre les rongeurs"},null,null,null,null,null,null,1.25,null,null,null,null,null,null,null,null,null,{"$f":"IF(Langue!$A$200 = \"FR\",Dictionnaire!$A28,Dictionnaire!$B28)","v":"Spirale de protection contre les rongeurs"},null,null,null,null,null,null,1.25]
[null,{"$f":"IF(Langue!$A$200 = \"FR\",Dictionnaire!$A29,Dictionnaire!$B29)","v":"Gaine de protection contre les chevreuils (Climanet)"},null,null,null,null,null,null,7.5,null,null,null,null,null,null,null,null,null,{"$f":"IF(Langue!$A$200 = \"FR\",Dictionnaire!$A29,Dictionnaire!$B29)","v":"Gaine de protection contre les chevreuils (Climanet)"},null,null,null,null,null,null,7.5]
[]
[]
[]
[null,{"$f":"IF(Langue!$A$200 = \"FR\",Dictionnaire!$A32,Dictionnaire!$B32)","v":"Marges sur coûts variables/ha, utilisés pour les calculs liés à la perte d'espace cultivable"},null,null,null,{"$f":"IF(Langue!$A$200 = \"FR\",Dictionnaire!$A33,Dictionnaire!$B33)","v":"Cultures"},null,{"$f":"IF(Langue!$A$200 = \"FR\",Dictionnaire!$A34,Dictionnaire!$B34)","v":"Marge sur coûts variables/ha *"},null,null,null,null,null,null,null,null,null,null,{"$f":"IF(Langue!$A$200 = \"FR\",Dictionnaire!$A32,Dictionnaire!$B32)","v":"Marges sur coûts variables/ha, utilisés pour les calculs liés à la perte d'espace cultivable"},null,null,null,{"$f":"IF(Langue!$A$200 = \"FR\",Dictionnaire!$A33,Dictionnaire!$B33)","v":"Cultures"},null,{"$f":"IF(Langue!$A$200 = \"FR\",Dictionnaire!$A34,Dictionnaire!$B34)","v":"Marge sur coûts variables/ha *"}]
[]
[null,null,null,null,null,{"$f":"IF(Langue!$A$200 = \"FR\",Dictionnaire!$A35,Dictionnaire!$B35)","v":"Foin"},null,521,null,"CRAAQ, Foin - Analyse comparative provinciale 2021 - Analyse de données Agritel - 2023 (AGDEX 120/891)",null,null,null,null,null,null,null,null,null,null,null,null,{"$f":"IF(Langue!$A$200 = \"FR\",Dictionnaire!$A35,Dictionnaire!$B35)","v":"Foin"},null,521,null,"CRAAQ, Foin - Analyse comparative provinciale 2021 - Analyse de données Agritel - 2023 (AGDEX 120/891)"]
[null,null,null,null,null,{"$f":"IF(Langue!$A$200 = \"FR\",Dictionnaire!$A36,Dictionnaire!$B36)","v":"Avoine"},null,468,null,"CRAAQ, Avoine d'alimentation animale - Budget à l'hectare - 2022 (AGDEX 113/821a)",null,null,null,null,null,null,null,null,null,null,null,null,{"$f":"IF(Langue!$A$200 = \"FR\",Dictionnaire!$A36,Dictionnaire!$B36)","v":"Avoine"},null,468,null,"CRAAQ, Avoine d'alimentation animale - Budget à l'hectare - 2022 (AGDEX 113/821a)"]
[null,null,null,null,null,{"$f":"IF(Langue!$A$200 = \"FR\",Dictionnaire!$A37,Dictionnaire!$B37)","v":"Avoine biologique"},null,222,null,"CRAAQ, Avoine biologique - Budget à l'hectare - 2023 (AGDEX 113.19/821b)",null,null,null,null,null,null,null,null,null,null,null,null,{"$f":"IF(Langue!$A$200 = \"FR\",Dictionnaire!$A37,Dictionnaire!$B37)","v":"Avoine biologique"},null,222,null,"CRAAQ, Avoine biologique - Budget à l'hectare - 2023 (AGDEX 113.19/821b)"]
[null,null,null,null,null,{"$f":"IF(Langue!$A$200 = \"FR\",Dictionnaire!$A38,Dictionnaire!$B38)","v":"Blé d'alimentation animale"},null,540,null,"CRAAQ, Blé fourrager de printemps - Budget à l'hectare - 2023 (AGDEX 112/891a)",null,null,null,null,null,null,null,null,null,null,null,null,{"$f":"IF(Langue!$A$200 = \"FR\",Dictionnaire!$A38,Dictionnaire!$B38)","v":"Blé d'alimentation animale"},null,540,null,"CRAAQ, Blé fourrager de printemps - Budget à l'hectare - 2023 (AGDEX 112/891a)"]
[null,null,null,null,null,{"$f":"IF(Langue!$A$200 = \"FR\",Dictionnaire!$A39,Dictionnaire!$B39)","v":"Blé d'alimentation humaine"},null,629,null,"CRAAQ, Blé panifiable de pintemps - Budget à l'hectare - 2023 (AGDEX 112/891b)",null,null,null,null,null,null,null,null,null,null,null,null,{"$f":"IF(Langue!$A$200 = \"FR\",Dictionnaire!$A39,Dictionnaire!$B39)","v":"Blé d'alimentation humaine"},null,629,null,"CRAAQ, Blé panifiable de pintemps - Budget à l'hectare - 2023 (AGDEX 112/891b)"]
[null,null,null,null,null,{"$f":"IF(Langue!$A$200 = \"FR\",Dictionnaire!$A40,Dictionnaire!$B40)","v":"Blé panifiable biologique"},null,744,null,"CRAAQ, Blé panifiable biologique – Budget à l'hectare – 2023 (AGDEX 112.19/821)",null,null,null,null,null,null,null,null,null,null,null,null,{"$f":"IF(Langue!$A$200 = \"FR\",Dictionnaire!$A40,Dictionnaire!$B40)","v":"Blé panifiable biologique"},null,744,null,"CRAAQ, Blé panifiable biologique – Budget à l'hectare – 2023 (AGDEX 112.19/821)"]
[null,null,null,null,null,{"$f":"IF(Langue!$A$200 = \"FR\",Dictionnaire!$A41,Dictionnaire!$B41)","v":"Orge d'alimentation animale"},null,458,null,"CRAAQ, Orge d'alimentation animale - Budget - 2022 (AGDEX 114/821a)",null,null,null,null,null,null,null,null,null,null,null,null,{"$f":"IF(Langue!$A$200 = \"FR\",Dictionnaire!$A41,Dictionnaire!$B41)","v":"Orge d'alimentation animale"},null,458,null,"CRAAQ, Orge d'alimentation animale - Budget - 2022 (AGDEX 114/821a)"]
[null,{"$f":"IF(Langue!$A$200 = \"FR\",Dictionnaire!$A105,Dictionnaire!$B105)","v":"** Modifier les noms pour pouvoir les sélectionner dans le choix de la rotation du questionnaire"},null,null,null,{"$f":"IF(Langue!$A$200 = \"FR\",Dictionnaire!$A42,Dictionnaire!$B42)","v":"Orge biologique"},null,557,null,"CRAAQ, Orge biologique - Budget à l'hectare - 2023 (AGDEX 114.19/821b)",null,null,null,null,null,null,null,null,{"$f":"IF(Langue!$A$200 = \"FR\",Dictionnaire!$A105,Dictionnaire!$B105)","v":"** Modifier les noms pour pouvoir les sélectionner dans le choix de la rotation du questionnaire"},null,null,null,{"$f":"IF(Langue!$A$200 = \"FR\",Dictionnaire!$A42,Dictionnaire!$B42)","v":"Orge biologique"},null,557,null,"CRAAQ, Orge biologique - Budget à l'hectare - 2023 (AGDEX 114.19/821b)"]
[null,null,null,null,null,{"$f":"IF(Langue!$A$200 = \"FR\",Dictionnaire!$A43,Dictionnaire!$B43)","v":"Maïs fourrager"},null,1381,null,"CRAAQ, Maïs fourrager - Budget à l'hectare - 2022 (AGDEX 111/821a)",null,null,null,null,null,null,null,null,null,null,null,null,{"$f":"IF(Langue!$A$200 = \"FR\",Dictionnaire!$A43,Dictionnaire!$B43)","v":"Maïs fourrager"},null,1381,null,"CRAAQ, Maïs fourrager - Budget à l'hectare - 2022 (AGDEX 111/821a)"]
[null,null,null,null,null,{"$f":"IF(Langue!$A$200 = \"FR\",Dictionnaire!$A44,Dictionnaire!$B44)","v":"Maïs grain"},null,2068,null,"CRAAQ, Maïs-grain - Budget à l'hectare - 2022 (AGDEX 111/821b)",null,null,null,null,null,null,null,null,null,null,null,null,{"$f":"IF(Langue!$A$200 = \"FR\",Dictionnaire!$A44,Dictionnaire!$B44)","v":"Maïs grain"},null,2068,null,"CRAAQ, Maïs-grain - Budget à l'hectare - 2022 (AGDEX 111/821b)"]
[null,null,null,null,null,{"$f":"IF(Langue!$A$200 = \"FR\",Dictionnaire!$A45,Dictionnaire!$B45)","v":"Maïs grain biologique"},null,3401,null,"CRAAQ, Maïs-grain biologique – Budget à l'hectare – 2023 (AGDEX 111.19/821a)",null,null,null,null,null,null,null,null,null,null,null,null,{"$f":"IF(Langue!$A$200 = \"FR\",Dictionnaire!$A45,Dictionnaire!$B45)","v":"Maïs grain biologique"},null,3401,null,"CRAAQ, Maïs-grain biologique – Budget à l'hectare – 2023 (AGDEX 111.19/821a)"]
[null,null,null,null,null,{"$f":"IF(Langue!$A$200 = \"FR\",Dictionnaire!$A46,Dictionnaire!$B46)","v":"Soya"},null,1057,null,"CRAAQ, Soya - Analyse comparative provinciale 2021 - Analyse de données Agritel - 2023 (AGDEX 141/891)",null,null,null,null,null,null,null,null,null,null,null,null,{"$f":"IF(Langue!$A$200 = \"FR\",Dictionnaire!$A46,Dictionnaire!$B46)","v":"Soya"},null,1057,null,"CRAAQ, Soya - Analyse comparative provinciale 2021 - Analyse de données Agritel - 2023 (AGDEX 141/891)"]
[null,null,null,null,null,{"$f":"IF(Langue!$A$200 = \"FR\",Dictionnaire!$A47,Dictionnaire!$B47)","v":"Soya alimentation humaine biologique"},null,2772,null,"CRAAQ, Soya humain biologique – Budget à l'hectare – 2023 (AGDEX 141.19/821)",null,null,null,null,null,null,null,null,null,null,null,null,{"$f":"IF(Langue!$A$200 = \"FR\",Dictionnaire!$A47,Dictionnaire!$B47)","v":"Soya alimentation humaine biologique"},null,2772,null,"CRAAQ, Soya humain biologique – Budget à l'hectare – 2023 (AGDEX 141.19/821)"]
[null,null,null,null,null,{"$f":"IF(Langue!$A$200 = \"FR\",Dictionnaire!$A48,Dictionnaire!$B48)","v":"Canola"},null,693,null,"CRAAQ, Canola - Budget à l'hectare - 2022 (AGDEX 149/821)",null,null,null,null,null,null,null,null,null,null,null,null,{"$f":"IF(Langue!$A$200 = \"FR\",Dictionnaire!$A48,Dictionnaire!$B48)","v":"Canola"},null,693,null,"CRAAQ, Canola - Budget à l'hectare - 2022 (AGDEX 149/821)"]
[null,null,null,null,null,{"$f":"IF(Langue!$A$200 = \"FR\",Dictionnaire!$A49,Dictionnaire!$B49)","v":"Canola biologique"},null,2306,null,"CRAAQ, Canola biologique – Budget à l'hectare – 2023 (AGDEX 149.19/821)",null,null,null,null,null,null,null,null,null,null,null,null,{"$f":"IF(Langue!$A$200 = \"FR\",Dictionnaire!$A49,Dictionnaire!$B49)","v":"Canola biologique"},null,2306,null,"CRAAQ, Canola biologique – Budget à l'hectare – 2023 (AGDEX 149.19/821)"]
[null,null,null,null,null,{"$f":"IF(Langue!$A$200 = \"FR\",Dictionnaire!$A50,Dictionnaire!$B50)","v":"Autre 1**"},null,0,null,null,null,null,null,null,null,null,null,null,null,null,null,null,{"$f":"IF(Langue!$A$200 = \"FR\",Dictionnaire!$A50,Dictionnaire!$B50)","v":"Autre 1**"},null,0]
[null,null,null,null,null,{"$f":"IF(Langue!$A$200 = \"FR\",Dictionnaire!$A51,Dictionnaire!$B51)","v":"Autre 2**"},null,0,null,null,null,null,null,null,null,null,null,null,null,null,null,null,{"$f":"IF(Langue!$A$200 = \"FR\",Dictionnaire!$A51,Dictionnaire!$B51)","v":"Autre 2**"},null,0]
[null,null,null,null,null,{"$f":"IF(Langue!$A$200 = \"FR\",Dictionnaire!$A52,Dictionnaire!$B52)","v":"Autre 3**"},null,0,null,null,null,null,null,null,null,null,null,null,null,null,null,null,{"$f":"IF(Langue!$A$200 = \"FR\",Dictionnaire!$A52,Dictionnaire!$B52)","v":"Autre 3**"},null,0]
[null,null,null,null,null,{"$f":"IF(Langue!$A$200 = \"FR\",Dictionnaire!$A53,Dictionnaire!$B53)","v":"Autre 4**"},null,0,null,null,null,null,null,null,null,null,null,null,null,null,null,null,{"$f":"IF(Langue!$A$200 = \"FR\",Dictionnaire!$A53,Dictionnaire!$B53)","v":"Autre 4**"},null,0]
[null,null,null,null,null,{"$f":"IF(Langue!$A$200 = \"FR\",Dictionnaire!$A54,Dictionnaire!$B54)","v":"Autre 5**"},null,0,null,null,null,null,null,null,null,null,null,null,null,null,null,null,{"$f":"IF(Langue!$A$200 = \"FR\",Dictionnaire!$A54,Dictionnaire!$B54)","v":"Autre 5**"},null,0]
[null,null,null,null,null,{"$f":"IF(Langue!$A$200 = \"FR\",Dictionnaire!$A55,Dictionnaire!$B55)","v":"Autre 6**"},null,0,null,null,null,null,null,null,null,null,null,null,null,null,null,null,{"$f":"IF(Langue!$A$200 = \"FR\",Dictionnaire!$A55,Dictionnaire!$B55)","v":"Autre 6**"},null,0]
[null,null,null,null,null,{"$f":"IF(Langue!$A$200 = \"FR\",Dictionnaire!$A56,Dictionnaire!$B56)","v":"Autre 7**"},null,0,null,null,null,null,null,null,null,null,null,null,null,null,null,null,{"$f":"IF(Langue!$A$200 = \"FR\",Dictionnaire!$A56,Dictionnaire!$B56)","v":"Autre 7**"},null,0]
[null,null,null,null,null,{"$f":"IF(Langue!$A$200 = \"FR\",Dictionnaire!$A57,Dictionnaire!$B57)","v":"Autre 8**"},null,0,null,null,null,null,null,null,null,null,null,null,null,null,null,null,{"$f":"IF(Langue!$A$200 = \"FR\",Dictionnaire!$A57,Dictionnaire!$B57)","v":"Autre 8**"},null,0]
[null,null,null,null,null,{"$f":"IF(Langue!$A$200 = \"FR\",Dictionnaire!$A58,Dictionnaire!$B58)","v":"Autre 9**"},null,0,null,null,null,null,null,null,null,null,null,null,null,null,null,null,{"$f":"IF(Langue!$A$200 = \"FR\",Dictionnaire!$A58,Dictionnaire!$B58)","v":"Autre 9**"},null,0]
[null,null,null,null,null,{"$f":"IF(Langue!$A$200 = \"FR\",Dictionnaire!$A59,Dictionnaire!$B59)","v":"Autre 10**"},null,0,null,null,null,null,null,null,null,null,null,null,null,null,null,null,{"$f":"IF(Langue!$A$200 = \"FR\",Dictionnaire!$A59,Dictionnaire!$B59)","v":"Autre 10**"},null,0]
[null,null,null,null,null,null,null,{"$f":"IF(Langue!$A$200 = \"FR\",Dictionnaire!$A106,Dictionnaire!$B106)","v":"*(adaptés des budgets du CRAAQ, 2018, 2019, 2020 et 2021)"},null,null,null,null,null,null,null,null,null,null,null,null,null,null,null,null,{"$f":"IF(Langue!$A$200 = \"FR\",Dictionnaire!$A106,Dictionnaire!$B106)","v":"*(adaptés des budgets du CRAAQ, 2018, 2019, 2020 et 2021)"}]
[]
[]
[]
[]
[null,{"$f":"IF(Langue!$A$200 = \"FR\",Dictionnaire!$A63,Dictionnaire!$B63)","v":"Prix de vente incluant le transport"},null,{"$f":"IF(Langue!$A$200 = \"FR\",Dictionnaire!$A64,Dictionnaire!$B64)","v":"Essences"},null,{"$f":"IF(Langue!$A$200 = \"FR\",Dictionnaire!$A65,Dictionnaire!$B65)","v":"Valeur si le bois est vendu pour le sciage "},{"$f":"IF(Langue!$A$200 = \"FR\",Dictionnaire!$A66,Dictionnaire!$B66)","v":"Valeur si le bois est vendu pour le déroulage "},{"$f":"IF(Langue!$A$200 = \"FR\",Dictionnaire!$A67,Dictionnaire!$B67)","v":"Valeur si le bois est vendu pour du bois de chauffage "},{"$f":"IF(Langue!$A$200 = \"FR\",Dictionnaire!$A68,Dictionnaire!$B68)","v":"Valeur de la biomasse brut (pâte ou autres destinations) "},null,null,null,null,null,null,null,null,null,{"$f":"IF(Langue!$A$200 = \"FR\",Dictionnaire!$A63,Dictionnaire!$B63)","v":"Prix de vente incluant le transport"},null,{"$f":"IF(Langue!$A$200 = \"FR\",Dictionnaire!$A64,Dictionnaire!$B64)","v":"Essences"},null,{"$f":"IF(Langue!$A$200 = \"FR\",Dictionnaire!$A65,Dictionnaire!$B65)","v":"Valeur si le bois est vendu pour le sciage "},{"$f":"IF(Langue!$A$200 = \"FR\",Dictionnaire!$A66,Dictionnaire!$B66)","v":"Valeur si le bois est vendu pour le déroulage "},{"$f":"IF(Langue!$A$200 = \"FR\",Dictionnaire!$A67,Dictionnaire!$B67)","v":"Valeur si le bois est vendu pour du bois de chauffage "},{"$f":"IF(Langue!$A$200 = \"FR\",Dictionnaire!$A68,Dictionnaire!$B68)","v":"Valeur de la biomasse brut (pâte ou autres destinations) "}]
[]
[]
[null,null,null,null,null," $/m3 solide"," $/m3 solide",{"$f":"IF(Langue!$A$200 = \"FR\",Dictionnaire!$A69,Dictionnaire!$B69)","v":"$/Corde de 8' (non débité)"},{"$f":"IF(Langue!$A$200 = \"FR\",Dictionnaire!$A70,Dictionnaire!$B70)","v":"$/TMV"},null,null,null,null,null,null,null,null,null,null,null,null,null," $/m3 solide"," $/m3 solide",{"$f":"IF(Langue!$A$200 = \"FR\",Dictionnaire!$A69,Dictionnaire!$B69)","v":"$/Corde de 8' (non débité)"},{"$f":"IF(Langue!$A$200 = \"FR\",Dictionnaire!$A70,Dictionnaire!$B70)","v":"$/TMV"}]
[null,null,null,{"$f":"IF(Langue!$A$200 = \"FR\",Dictionnaire!$A71,Dictionnaire!$B71)","v":"Épinettes, Pins ou Thuyas"},null,52,null,null,30,null,null,null,null,null,null,null,null,null,null,null,{"$f":"IF(Langue!$A$200 = \"FR\",Dictionnaire!$A71,Dictionnaire!$B71)","v":"Épinettes, Pins ou Thuyas"},null,52,null,null,30]
[null,null,null,{"$f":"IF(Langue!$A$200 = \"FR\",Dictionnaire!$A72,Dictionnaire!$B72)","v":"Peupliers hybrides"},null,41,65,null,32,null,null,null,null,null,null,null,null,null,null,null,{"$f":"IF(Langue!$A$200 = \"FR\",Dictionnaire!$A72,Dictionnaire!$B72)","v":"Peupliers hybrides"},null,41,65,null,32]
[null,null,null,{"$f":"IF(Langue!$A$200 = \"FR\",Dictionnaire!$A73,Dictionnaire!$B73)","v":"Feuillus nobles"},null,61,145,225,40,null,null,null,null,null,null,null,null,null,null,null,{"$f":"IF(Langue!$A$200 = \"FR\",Dictionnaire!$A73,Dictionnaire!$B73)","v":"Feuillus nobles"},null,61,145,225,40]
[null,null,null,{"$f":"IF(Langue!$A$200 = \"FR\",Dictionnaire!$A74,Dictionnaire!$B74)","v":"Saules hybrides (tonne M.S.)"},null,null,null,null,32,null,null,null,null,null,null,null,null,null,null,null,{"$f":"IF(Langue!$A$200 = \"FR\",Dictionnaire!$A74,Dictionnaire!$B74)","v":"Saules hybrides (tonne M.S.)"},null,null,null,null,32]
[]
[]
[null,null,null,null,null,null,{"$f":"IF(Langue!$A$200 = \"FR\",Dictionnaire!$A76,Dictionnaire!$B76)","v":"Le menu simulation permet de changer tous ces paramètres"},null,null,null,null,null,null,null,null,null,null,null,null,null,null,null,null,{"$f":"IF(Langue!$A$200 = \"FR\",Dictionnaire!$A76,Dictionnaire!$B76)","v":"Le menu simulation permet de changer tous ces paramètres"}]
[]
[]
[]
[]
[]
[]
[null,null,null,null,null,null,null,null,null,null,null,null,null,null,"..."]
[null,null,null,null,null,null,null,null,null,null,null,null,null,null,"..."]
[]
[]
[]
[null,{"$f":"IF(Langue!$A$200 = \"FR\",Dictionnaire!$A79,Dictionnaire!$B79)","v":"Quelle est la hauteur maximale d'une haie de peupliers hybrides à maturité?"},null,null,null,null,null,null,25,"m",null,null,null,null,null,null,null,null,{"$f":"IF(Langue!$A$200 = \"FR\",Dictionnaire!$A79,Dictionnaire!$B79)","v":"Quelle est la hauteur maximale d'une haie de peupliers hybrides à maturité?"},null,null,null,null,null,null,25,"m"]
[null,{"$f":"IF(Langue!$A$200 = \"FR\",Dictionnaire!$A80,Dictionnaire!$B80)","v":"Quelle est la hauteur maximale d'une haie de conifères ou de feuillus nobles à maturité?"},null,null,null,null,null,null,15,"m",null,null,null,null,null,null,null,null,{"$f":"IF(Langue!$A$200 = \"FR\",Dictionnaire!$A80,Dictionnaire!$B80)","v":"Quelle est la hauteur maximale d'une haie de conifères ou de feuillus nobles à maturité?"},null,null,null,null,null,null,15,"m"]
[null,{"$f":"IF(Langue!$A$200 = \"FR\",Dictionnaire!$A81,Dictionnaire!$B81)","v":"Quelle est la hauteur maximale d'une haie de saules à maturité?"},null,null,null,null,null,null,6,"m",null,null,null,null,null,null,null,null,{"$f":"IF(Langue!$A$200 = \"FR\",Dictionnaire!$A81,Dictionnaire!$B81)","v":"Quelle est la hauteur maximale d'une haie de saules à maturité?"},null,null,null,null,null,null,6,"m"]
[null,{"$f":"IF(Langue!$A$200 = \"FR\",Dictionnaire!$A82,Dictionnaire!$B82)","v":"Quelle est la hauteur maximale d'une haie d'arbustes à maturité?"},null,null,null,null,null,null,3,"m",null,null,null,null,null,null,null,null,{"$f":"IF(Langue!$A$200 = \"FR\",Dictionnaire!$A82,Dictionnaire!$B82)","v":"Quelle est la hauteur maximale d'une haie d'arbustes à maturité?"},null,null,null,null,null,null,3,"m"]
[]
[null,{"$f":"IF(Langue!$A$200 = \"FR\",Dictionnaire!$A83,Dictionnaire!$B83)","v":"Augmentations de la marge (produits sur débours/ha) utilisées pour les calculs liées à la protection de culture (résultat obtenu en multipliant le rendement par le prix à la tonne par une augmentation de rendement de 1%)."},null,null,null,{"$f":"IF(Langue!$A$200 = \"FR\",Dictionnaire!$A84,Dictionnaire!$B84)","v":"Cultures"},null,{"$f":"IF(Langue!$A$200 = \"FR\",Dictionnaire!$A85,Dictionnaire!$B85)","v":"Augmentation de la marge (produits sur débours/ha) avec protection de culture*"},null,null,null,"Rendement (t/ha)","Prix de vente ($/t)",null,null,null,null,null,{"$f":"IF(Langue!$A$200 = \"FR\",Dictionnaire!$A83,Dictionnaire!$B83)","v":"Augmentations de la marge (produits sur débours/ha) utilisées pour les calculs liées à la protection de culture (résultat obtenu en multipliant le rendement par le prix à la tonne par une augmentation de rendement de 1%)."},null,null,null,{"$f":"IF(Langue!$A$200 = \"FR\",Dictionnaire!$A84,Dictionnaire!$B84)","v":"Cultures"},null,{"$f":"IF(Langue!$A$200 = \"FR\",Dictionnaire!$A85,Dictionnaire!$B85)","v":"Augmentation de la marge (produits sur débours/ha) avec protection de culture*"}]
[]
[null,null,null,null,null,{"$f":"F48","v":"Foin"},null,12.38,null,"CRAAQ, Foin - Analyse comparative provinciale 2021 - Analyse de données Agritel - 2023 (AGDEX 120/891)",null,null,null,null,null,null,null,null,null,null,null,null,{"$f":"W48","v":"Foin"},null,12.38,null,"CRAAQ, Foin - Analyse comparative provinciale 2021 - Analyse de données Agritel - 2023 (AGDEX 120/891)"]
[null,null,null,null,null,{"$f":"F49","v":"Avoine"},null,7.93,null,"CRAAQ, Avoine d'alimentation animale - Budget à l'hectare - 2022 (AGDEX 113/821a)",null,null,null,null,null,null,null,null,null,null,null,null,{"$f":"W49","v":"Avoine"},null,7.93,null,"CRAAQ, Avoine d'alimentation animale - Budget à l'hectare - 2022 (AGDEX 113/821a)"]
[null,null,null,null,null,"Avoine biologique",null,11.96,null,"CRAAQ, Avoine biologique - Budget à l'hectare - 2023 (AGDEX 113.19/821b)",null,null,null,null,null,null,null,null,null,null,null,null,"Avoine biologique",null,11.96,null,"CRAAQ, Avoine biologique - Budget à l'hectare - 2023 (AGDEX 113.19/821b)"]
[null,null,null,null,null,"Blé d'alimentation animale",null,11.77,null,"CRAAQ, Blé fourrager de printemps - Budget à l'hectare - 2023 (AGDEX 112/891a)",null,null,null,null,null,null,null,null,null,null,null,null,"Blé d'alimentation animale",null,11.77,null,"CRAAQ, Blé fourrager de printemps - Budget à l'hectare - 2023 (AGDEX 112/891a)"]
[null,null,null,null,null,"Blé d'alimentation humaine",null,13.11,null,"CRAAQ, Blé panifiable de pintemps - Budget à l'hectare - 2023 (AGDEX 112/891b)",null,null,null,null,null,null,null,null,null,null,null,null,"Blé d'alimentation humaine",null,13.11,null,"CRAAQ, Blé panifiable de pintemps - Budget à l'hectare - 2023 (AGDEX 112/891b)"]
[null,null,null,null,null,"Blé panifiable biologique",null,19.23,null,"CRAAQ, Blé panifiable biologique – Budget à l'hectare – 2023 (AGDEX 112.19/821)",null,null,null,null,null,null,null,null,null,null,null,null,"Blé panifiable biologique",null,19.23,null,"CRAAQ, Blé panifiable biologique – Budget à l'hectare – 2023 (AGDEX 112.19/821)"]
[null,null,null,null,null,"Orge d'alimentation animale",null,11.27,null,"CRAAQ, Orge d'alimentation animale - Budget - 2022 (AGDEX 114/821a)",null,null,null,null,null,null,null,null,null,null,null,null,"Orge d'alimentation animale",null,11.27,null,"CRAAQ, Orge d'alimentation animale - Budget - 2022 (AGDEX 114/821a)"]
[null,null,null,null,null,"Orge biologique",null,14.8,null,"CRAAQ, Orge biologique - Budget à l'hectare - 2023 (AGDEX 114.19/821b)",null,null,null,null,null,null,null,null,null,null,null,null,"Orge biologique",null,14.8,null,"CRAAQ, Orge biologique - Budget à l'hectare - 2023 (AGDEX 114.19/821b)"]
[null,{"$f":"IF(Langue!$A$200 = \"FR\",Dictionnaire!$A105,Dictionnaire!$B105)","v":"** Modifier les noms pour pouvoir les sélectionner dans le choix de la rotation du questionnaire"},null,null,null,"Maïs fourrager",null,33.14,null,"CRAAQ, Maïs fourrager - Budget à l'hectare - 2022 (AGDEX 111/821a)",null,null,null,null,null,null,null,null,{"$f":"IF(Langue!$A$200 = \"FR\",Dictionnaire!$A105,Dictionnaire!$B105)","v":"** Modifier les noms pour pouvoir les sélectionner dans le choix de la rotation du questionnaire"},null,null,null,"Maïs fourrager",null,33.14,null,"CRAAQ, Maïs fourrager - Budget à l'hectare - 2022 (AGDEX 111/821a)"]
[null,null,null,null,null,"Maïs grain",null,37.5,null,"CRAAQ, Maïs-grain - Budget à l'hectare - 2022 (AGDEX 111/821b)",null,null,null,null,null,null,null,null,null,null,null,null,"Maïs grain",null,37.5,null,"CRAAQ, Maïs-grain - Budget à l'hectare - 2022 (AGDEX 111/821b)"]
[null,null,null,null,null,"Maïs grain biologique",null,50.41,null,"CRAAQ, Maïs-grain biologique – Budget à l'hectare – 2023 (AGDEX 111.19/821a)",null,null,null,null,null,null,null,null,null,null,null,null,"Maïs grain biologique",null,50.41,null,"CRAAQ, Maïs-grain biologique – Budget à l'hectare – 2023 (AGDEX 111.19/821a)"]
[null,null,null,null,null,"Soya",null,19.11,null,"CRAAQ, Soya - Analyse comparative provinciale 2021 - Analyse de données Agritel - 2023 (AGDEX 141/891)",null,null,null,null,null,null,null,null,null,null,null,null,"Soya",null,19.11,null,"CRAAQ, Soya - Analyse comparative provinciale 2021 - Analyse de données Agritel - 2023 (AGDEX 141/891)"]
[null,null,null,null,null,"Soya alimentation humaine biologique",null,34.31,null,"CRAAQ, Soya humain biologique – Budget à l'hectare – 2023 (AGDEX 141.19/821)",null,null,null,null,null,null,null,null,null,null,null,null,"Soya alimentation humaine biologique",null,34.31,null,"CRAAQ, Soya humain biologique – Budget à l'hectare – 2023 (AGDEX 141.19/821)"]
[null,null,null,null,null,"Canola",null,17.23,null,"CRAAQ, Canola - Budget à l'hectare - 2022 (AGDEX 149/821)",null,null,null,null,null,null,null,null,null,null,null,null,"Canola",null,17.23,null,"CRAAQ, Canola - Budget à l'hectare - 2022 (AGDEX 149/821)"]
[null,null,null,null,null,"Canola biologique",null,33,null,"CRAAQ, Canola biologique – Budget à l'hectare – 2023 (AGDEX 149.19/821)",null,null,null,null,null,null,null,null,null,null,null,null,"Canola biologique",null,33,null,"CRAAQ, Canola biologique – Budget à l'hectare – 2023 (AGDEX 149.19/821)"]
[null,null,null,null,null,"Autre 1**",null,0,null,null,null,null,null,null,null,null,null,null,null,null,null,null,"Autre 1**",null,0]
[null,null,null,null,null,"Autre 2**",null,0,null,null,null,null,null,null,null,null,null,null,null,null,null,null,"Autre 2**",null,0]
[null,null,null,null,null,"Autre 3**",null,0,null,null,null,null,null,null,null,null,null,null,null,null,null,null,"Autre 3**",null,0]
[null,null,null,null,null,"Autre 4**",null,0,null,null,null,null,null,null,null,null,null,null,null,null,null,null,"Autre 4**",null,0]
[null,null,null,null,null,"Autre 5**",null,0,null,null,null,null,null,null,null,null,null,null,null,null,null,null,"Autre 5**",null,0]
[null,null,null,null,null,"Autre 6**",null,0,null,null,null,null,null,null,null,null,null,null,null,null,null,null,"Autre 6**",null,0]
[null,null,null,null,null,"Autre 7**",null,0,null,null,null,null,null,null,null,null,null,null,null,null,null,null,"Autre 7**",null,0]
[null,null,null,null,null,"Autre 8**",null,0,null,null,null,null,null,null,null,null,null,null,null,null,null,null,"Autre 8**",null,0]
[null,null,null,null,null,"Autre 9**",null,0,null,null,null,null,null,null,null,null,null,null,null,null,null,null,"Autre 9**",null,0]
[null,null,null,null,null,"Autre 10**",null,0,null,null,null,null,null,null,null,null,null,null,null,null,null,null,"Autre 10**",null,0]
[null,null,null,null,null,null,null,{"$f":"IF(Langue!$A$200 = \"FR\",Dictionnaire!$A106,Dictionnaire!$B106)","v":"*(adaptés des budgets du CRAAQ, 2018, 2019, 2020 et 2021)"},null,null,null,null,null,null,null,null,null,null,null,null,null,null,null,null,{"$f":"IF(Langue!$A$200 = \"FR\",Dictionnaire!$A106,Dictionnaire!$B106)","v":"*(adaptés des budgets du CRAAQ, 2018, 2019, 2020 et 2021)"}]
[]
[]
[]
[]
[]
[]
[]
[]
[]
[]
[]
[]
[]
[]
[]
[]
[]
[]
[]
[]
[]
[]
[]
[]
[]
[]
[]
[]
[]
[]
[]
[]
[]
[]
[]
[]
[]
[]
[]
[]
[]
[]
[]
[]
[]
[]
[]
[]
[]
[]
[]
[]
[]
[]
[]
[]
[]
[null,{"$f":"IF(Langue!$A$200 = \"FR\",Dictionnaire!A107,Dictionnaire!B107)","v":"Informations concernant les paramètres "},null,null,null,null,null,null,null,null,null,null,null,null,null,null,null,null,{"$f":"IF(Langue!$A$200 = \"FR\",Dictionnaire!R107,Dictionnaire!S107)","v":0}]
[]
[]
[]
[]
[]
[]
[]
[]
[]
["EN"]

{"sheet":"Remerciements","index":6,"n_rows":56,"n_cols":3,"rows_kept":56,"cut":false,"hidden":false,"merged":[[49,1,50,8],[1,2,1,7]]}
[]
[null,null,{"$f":"IF(Langue!$A$200 = \"FR\",Dictionnaire!A123,Dictionnaire!B123)","v":"Remerciements"}]
[]
[]
[]
[]
[]
[]
[]
[]
[]
[]
[]
[]
[]
[]
[]
[]
[]
[]
[]
[]
[]
[]
[]
[]
[]
[]
[]
[]
[]
[]
[]
[]
[]
[]
[]
[]
[]
[]
[]
[]
[]
[]
[]
[]
[]
[]
[]
[null,{"$f":"IF(Langue!$A$200 = \"FR\",Dictionnaire!A119,Dictionnaire!B119)","v":"À propos du logiciel"}]
[]
[]
[]
[]
[]
[null,{"$f":"IF(Langue!$A$200 = \"FR\",Dictionnaire!A121,Dictionnaire!B121)","v":"Outil de simulation des impacts économiques de pratiques agroforestières version 24.02.1 (février 2024)"}]

{"sheet":"Menu simulation","index":7,"n_rows":14,"n_cols":8,"rows_kept":14,"cut":false,"hidden":false,"merged":[[1,3,1,7],[5,1,10,4],[13,1,16,4],[2,3,2,7],[3,3,3,7]]}
[]
[null,null,null,{"$f":"IF(Langue!$A$200 = \"FR\",Dictionnaire!A297,Dictionnaire!B297)","v":"Menu simulation"}]
[]
[]
[]
[null,{"$f":"IF(Langue!$A$200 = \"FR\",Dictionnaire!A299,Dictionnaire!B299)","v":"Étape 1 : choisissez à quelle fin vous désirez faire l'implantation de vos végétaux"},null,null,null,null,null,false]
[]
[null,null,null,null,null,null,null,false]
[]
[null,null,null,null,null,null,null,true]
[]
[null,null,null,null,null,null,null,false]
[]
[null,{"$f":"IF(Langue!$A$200 = \"FR\",Dictionnaire!A300,Dictionnaire!B300)","v":"Étape 2 : complétez le questionnaire"}]

{"sheet":"Questionnaire","index":8,"n_rows":775,"n_cols":56,"rows_kept":775,"cut":false,"hidden":false,"merged":[[136,7,138,8],[100,1,101,5],[1,1,1,8],[42,4,42,5],[75,2,75,5]]}
[]
[null,"Questionnaire"]
[]
[null,"\n"]
[]
[null," "]
[]
[]
[]
[]
[null,null,null,null,null,null,null,null,null,null,null,null,null,null,null,null,null,null,null,null,null,null,null,null,null,null,null,"Liste rangée",null,"choix"]
[null,{"$f":"IF(Langue!$A$200 = \"FR\",Dictionnaire!A128,Dictionnaire!B128)","v":"Section 1 : Établissement de la haie"},null,null,null,null,null,null,null,null,null,null,null,null,null,null,null,null,null,null,null,null,null,null,null,null,null,1,1,0]
[null,null,null,null,null,null,null,null,null,null,null,null,null,null,null,null,null,null,null,null,null,null,null,null,null,null,null,2,2]
[null,{"$f":"IF(Langue!$A$200 = \"FR\",Dictionnaire!A129,Dictionnaire!B129)","v":"Taux d'actualisation annuel ?"},null,null,0.06,null,null,null,null,null,null,null,null,null,null,null,null,null,null,null,null,null,null,null,null,null,null,3,3]
[null,null,null,null,null,null,null,null,null,null,null,null,null,null,null,null,null,null,null,null,null,null,null,null,null,null,null,4,4]
[null,{"$f":"IF(Langue!$A$200 = \"FR\",Dictionnaire!A130,Dictionnaire!B130)","v":"Longueur de la haie (m) ?"},null,null,0,null,null,null,null,null,null,null,null,null,null,null,null,null,null,null,null,null,null,null,null,null,null,5,5]
[null,null,null,null,null,null,null,null,null,null,null,null,null,null,null,null,null,null,null,null,null,null,null,null,null,null,null,6,6]
[null,{"$f":"IF(Langue!$A$200 = \"FR\",Dictionnaire!A131,Dictionnaire!B131)","v":"Nombre de rangées ? (maximum 7)"},null,null,{"$f":"AD12*1","v":0},null,null,null,null,null,null,null,null,null,null,null,null,null,null,null,null,null,null,null,null,null,null,7,7]
[]
[null,{"$f":"IF(Langue!$A$200 = \"FR\",Dictionnaire!A132,Dictionnaire!B132)","v":"Espacement entre les rangées (m) ?"},null,null,0,"m",null,null,null,null,null,null,null,null,null,null,null,null,null,null,null,null,null,null,null,null,null,null,null,195]
[]
[null,{"$f":"IF(Langue!$A$200 = \"FR\",Dictionnaire!A133,Dictionnaire!B133)","v":"Quelle est la séquence d'établissement des arbres et/ou arbustes ?"},null,null,null,null,null,null,null,null,null,null,null,null,null,null,null,null,null,null,null,null,null,null,null,null,null,null,null,null,null,null,null,null,null,null,"Zone de calcul pour rangee à récolter"]
[]
[null,null,{"$f":"IF(Langue!$A$200 = \"FR\",Dictionnaire!A134,Dictionnaire!B134)","v":"Espèce no.1"},{"$f":"IF(Langue!$A$200 = \"FR\",Dictionnaire!A135,Dictionnaire!B135)","v":"Espèce no.2"},{"$f":"IF(Langue!$A$200 = \"FR\",Dictionnaire!A136,Dictionnaire!B136)","v":"Espèce no.3"},{"$f":"IF(Langue!$A$200 = \"FR\",Dictionnaire!A137,Dictionnaire!B137)","v":"Espèce no.4"},{"$f":"IF(Langue!$A$200 = \"FR\",Dictionnaire!A138,Dictionnaire!B138)","v":"Espèce no.5"},{"$f":"IF(Langue!$A$200 = \"FR\",Dictionnaire!A139,Dictionnaire!B139)","v":"Espèce no.6"},{"$f":"IF(Langue!$A$200 = \"FR\",Dictionnaire!A140,Dictionnaire!B140)","v":"Espèce no.7"},null,null,null,null,null,null,null,null,null,null,null,null,null,null,null,null,null,null,null,null,null,null,null,null,null,null,null,"PRES PEH","PRES FNO","PRES CON","PRE ARB","PRS SAULE","NB PEH","NB FNO","NB CON","PRE ARB","PRS SAULE","Total","% ARB","% SAH","espacement","nb plant dans la haie","nb arbuste","pres_ARB_SAH","CON_PEH","FNO_ARB","CON_PEH_SANFNO_sans_arb"]
[null,{"$f":"IF(Langue!$A$200 = \"FR\",Dictionnaire!A141,Dictionnaire!B141)","v":"Rangée 1"},null,null,null,null,null,null,null,null,null,null,null,null,null,null,null,null,null,null,null,null,null,null,null,null,null,null,{"$f":"C25","v":0},0,0,0,0,0,0,"Rangée 1",{"$f":"IF($E$18<1,0,(IF(COUNTIF($C25:$I25,\"PEH\")>0,1,IF(COUNTIF($C25:$I25,\"HPO\")>0,1,0))))","v":0},{"$f":"IF($E$18<1,0,(IF(COUNTIF($C25:$I25,\"FNO\")>0,1,IF(COUNTIF($C25:$I25,\"HWD\")>0,1,0))))","v":0},{"$f":"IF($E$18<1,0,(IF(COUNTIF($C25:$I25,\"CON\")>0,1,IF(COUNTIF($C25:$I25,\"CON\")>0,1,0))))","v":0},{"$f":"IF($E$18<1,0,(IF(COUNTIF($C25:$I25,\"ARB\")>0,1,IF(COUNTIF($C25:$I25,\"SHR\")>0,1,0))))","v":0},{"$f":"IF($E$18<1,0,(IF(COUNTIF($C25:$I25,\"SAH\")>0,1,IF(COUNTIF($C25:$I25,\"HWL\")>0,1,0))))","v":0},{"$f":"IF($E$18<1,0,COUNTIF($C25:$I25,\"PEH\")+COUNTIF($C25:$I25,\"HPO\"))","v":0},{"$f":"IF($E$18<1,0,COUNTIF($C25:$I25,\"FNO\")+COUNTIF($C25:$I25,\"HWD\"))","v":0},{"$f":"IF($E$18<1,0,COUNTIF($C25:$I25,\"CON\"))","v":0},{"$f":"IF($E$18<1,0,COUNTIF($C25:$I25,\"ARB\")+COUNTIF($C25:$I25,\"SHR\"))","v":0},{"$f":"IF($E$18<1,0,COUNTIF($C25:$I25,\"SAH\")+COUNTIF($C25:$I25,\"HWL\"))","v":0},{"$f":"SUM(AP25:AT25)","v":0},{"$f":"AS25/AU25","v":{"$error":"#DIV/0!"}},{"$f":"AT25/AU25","v":{"$error":"#DIV/0!"}},{"$f":"C35*1","v":0},{"$f":"$E$16/AX25/AU25","v":{"$error":"#DIV/0!"}},{"$f":"AY25*AS25","v":{"$error":"#DIV/0!"}},{"$f":"IF((AO25+AN25)>=1,1,0)","v":0},{"$f":"IF((AM25+AP25)>=1,1,0)","v":0},{"$f":"IF((AL25+BA25)>=2,1,0)","v":0},{"$f":"IF(AND(BB25>=1,AL25<1,BA25<1),1,0)","v":0}]
[null,{"$f":"IF(Langue!$A$200 = \"FR\",Dictionnaire!A142,Dictionnaire!B142)","v":"Rangée 2"},null,null,null,null,null,null,null,null,null,null,null,null,null,null,null,null,null,null,null,null,null,null,null,null,null,null,0,0,0,0,0,0,0,"Rangée 2",{"$f":"IF($E$18<2,0,(IF(COUNTIF($C26:$I26,\"PEH\")>0,1,IF(COUNTIF($C26:$I26,\"HPO\")>0,1,0))))","v":0},{"$f":"IF($E$18<2,0,IF(COUNTIF($C26:$I26,\"FNO\")>0,1,IF(COUNTIF($C26:$I26,\"HWD\")>0,1,0)))","v":0},{"$f":"IF($E$18<2,0,(IF(COUNTIF($C26:$I26,\"CON\")>0,1,IF(COUNTIF($C26:$I26,\"CON\")>0,1,0))))","v":0},{"$f":"IF($E$18<2,0,(IF(COUNTIF($C26:$I26,\"ARB\")>0,1,IF(COUNTIF($C26:$I26,\"SHR\")>0,1,0))))","v":0},{"$f":"IF($E$18<2,0,(IF(COUNTIF($C26:$I26,\"SAH\")>0,1,IF(COUNTIF($C26:$I26,\"HWL\")>0,1,0))))","v":0},{"$f":"IF($E$18<2,0,COUNTIF($C26:$I26,\"PEH\")+COUNTIF($C26:$I26,\"HPO\"))","v":0},{"$f":"IF($E$18<2,0,COUNTIF($C26:$I26,\"FNO\")+COUNTIF($C26:$I26,\"HWD\"))","v":0},{"$f":"IF($E$18<2,0,COUNTIF($C26:$I26,\"CON\"))","v":0},{"$f":"IF($E$18<2,0,COUNTIF($C26:$I26,\"ARB\")+COUNTIF($C26:$I26,\"SHR\"))","v":0},{"$f":"IF($E$18<2,0,COUNTIF($C26:$I26,\"SAH\")+COUNTIF($C26:$I26,\"HWL\"))","v":0},{"$f":"SUM(AP26:AT26)","v":0},{"$f":"AS26/AU26","v":{"$error":"#DIV/0!"}},{"$f":"AT26/AU26","v":{"$error":"#DIV/0!"}},{"$f":"C36*1","v":0},{"$error":"#DIV/0!"},{"$f":"AY26*AS26","v":{"$error":"#DIV/0!"}},{"$f":"IF((AO26+AN26)>=1,1,0)","v":0},{"$f":"IF((AM26+AP26)>=1,1,0)","v":0},{"$f":"IF((AL26+BA26)>=2,1,0)","v":0},{"$f":"IF(AND(BB26>=1,AL26<1,BA26<1),1,0)","v":0}]
[null,{"$f":"IF(Langue!$A$200 = \"FR\",Dictionnaire!A143,Dictionnaire!B143)","v":"Rangée 3"},null,null,null,null,null,null,null,null,null,null,null,null,null,null,null,null,null,null,null,null,null,null,null,null,null,null,0,0,0,0,0,0,0,"Rangée 3",{"$f":"IF($E$18<3,0,(IF(COUNTIF($C27:$I27,\"PEH\")>0,1,IF(COUNTIF($C27:$I27,\"HPO\")>0,1,0))))","v":0},{"$f":"IF($E$18<3,0,(IF(COUNTIF($C27:$I27,\"FNO\")>0,1,IF(COUNTIF($C27:$I27,\"HWD\")>0,1,0))))","v":0},{"$f":"IF($E$18<3,0,(IF(COUNTIF($C27:$I27,\"CON\")>0,1,IF(COUNTIF($C27:$I27,\"CON\")>0,1,0))))","v":0},{"$f":"IF($E$18<3,0,(IF(COUNTIF($C27:$I27,\"ARB\")>0,1,IF(COUNTIF($C27:$I27,\"SHR\")>0,1,0))))","v":0},{"$f":"IF($E$18<3,0,(IF(COUNTIF($C27:$I27,\"SAH\")>0,1,IF(COUNTIF($C27:$I27,\"HWL\")>0,1,0))))","v":0},{"$f":"IF($E$18<3,0,(COUNTIF($C27:$I27,\"PEH\")+COUNTIF($C27:$I27,\"HPO\")))","v":0},{"$f":"IF($E$18<3,0,(COUNTIF($C27:$I27,\"FNO\")+COUNTIF($C27:$I27,\"HWD\")))","v":0},{"$f":"IF($E$18<3,0,COUNTIF($C27:$I27,\"CON\"))","v":0},{"$f":"IF($E$18<3,0,(COUNTIF($C27:$I27,\"ARB\")+COUNTIF($C27:$I27,\"SHR\")))","v":0},{"$f":"IF($E$18<3,0,COUNTIF($C27:$I27,\"SAH\")+COUNTIF($C27:$I27,\"HWL\"))","v":0},0,{"$error":"#DIV/0!"},{"$error":"#DIV/0!"},0,{"$f":"$E$16/AX27/AU27","v":{"$error":"#DIV/0!"}},{"$error":"#DIV/0!"},0,0,0,0]
[null,{"$f":"IF(Langue!$A$200 = \"FR\",Dictionnaire!A144,Dictionnaire!B144)","v":"Rangée 4"},null,null,null,null,null,null,null,null,null,null,null,null,null,null,null,null,null,null,null,null,null,null,null,null,null,null,0,0,0,0,0,0,0,"Rangée 4",{"$f":"IF($E$18<4,0,(IF(COUNTIF($C28:$I28,\"PEH\")>0,1,IF(COUNTIF($C28:$I28,\"HPO\")>0,1,0))))","v":0},{"$f":"IF($E$18<4,0,(IF(COUNTIF($C28:$I28,\"FNO\")>0,1,IF(COUNTIF($C28:$I28,\"HWD\")>0,1,0))))","v":0},{"$f":"IF($E$18<4,0,(IF(COUNTIF($C28:$I28,\"CON\")>0,1,IF(COUNTIF($C28:$I28,\"CON\")>0,1,0))))","v":0},{"$f":"IF($E$18<4,0,(IF(COUNTIF($C28:$I28,\"ARB\")>0,1,IF(COUNTIF($C28:$I28,\"SHR\")>0,1,0))))","v":0},{"$f":"IF($E$18<4,0,(IF(COUNTIF($C28:$I28,\"SAH\")>0,1,IF(COUNTIF($C28:$I28,\"HWL\")>0,1,0))))","v":0},{"$f":"IF($E$18<4,0,(COUNTIF($C28:$I28,\"PEH\")+COUNTIF($C28:$I28,\"HPO\")))","v":0},{"$f":"IF($E$18<4,0,(COUNTIF($C28:$I28,\"FNO\")+COUNTIF($C28:$I28,\"HWD\")))","v":0},{"$f":"IF($E$18<4,0,COUNTIF($C28:$I28,\"CON\"))","v":0},{"$f":"IF($E$18<4,0,(COUNTIF($C28:$I28,\"ARB\")+COUNTIF($C28:$I28,\"SHR\")))","v":0},{"$f":"IF($E$18<4,0,COUNTIF($C28:$I28,\"SAH\")+COUNTIF($C28:$I28,\"HWL\"))","v":0},0,{"$error":"#DIV/0!"},{"$error":"#DIV/0!"},0,{"$error":"#DIV/0!"},{"$error":"#DIV/0!"},0,0,0,0]
[null,{"$f":"IF(Langue!$A$200 = \"FR\",Dictionnaire!A145,Dictionnaire!B145)","v":"Rangée 5"},null,null,null,null,null,null,null,null,null,null,null,null,null,null,null,null,null,null,null,null,null,null,null,null,null,null,null,null,null,null,null,null,null,"Rangée 5",{"$f":"IF($E$18<5,0,(IF(COUNTIF($C29:$I29,\"PEH\")>0,1,IF(COUNTIF($C29:$I29,\"HPO\")>0,1,0))))","v":0},{"$f":"IF($E$18<5,0,(IF(COUNTIF($C29:$I29,\"FNO\")>0,1,IF(COUNTIF($C29:$I29,\"HWD\")>0,1,0))))","v":0},{"$f":"IF($E$18<5,0,(IF(COUNTIF($C29:$I29,\"CON\")>0,1,IF(COUNTIF($C29:$I29,\"CON\")>0,1,0))))","v":0},{"$f":"IF($E$18<5,0,(IF(COUNTIF($C29:$I29,\"ARB\")>0,1,IF(COUNTIF($C29:$I29,\"SHR\")>0,1,0))))","v":0},{"$f":"IF($E$18<5,0,(IF(COUNTIF($C29:$I29,\"SAH\")>0,1,IF(COUNTIF($C29:$I29,\"HWL\")>0,1,0))))","v":0},{"$f":"IF($E$18<5,0,(COUNTIF($C29:$I29,\"PEH\")+COUNTIF($C29:$I29,\"HPO\")))","v":0},{"$f":"IF($E$18<5,0,(COUNTIF($C29:$I29,\"FNO\")+COUNTIF($C29:$I29,\"HWD\")))","v":0},{"$f":"IF($E$18<5,0,COUNTIF($C29:$I29,\"CON\"))","v":0},{"$f":"IF($E$18<5,0,(COUNTIF($C29:$I29,\"ARB\")+COUNTIF($C29:$I29,\"SHR\")))","v":0},{"$f":"IF($E$18<5,0,COUNTIF($C29:$I29,\"SAH\")+COUNTIF($C29:$I29,\"HWL\"))","v":0},0,{"$error":"#DIV/0!"},{"$error":"#DIV/0!"},0,{"$error":"#DIV/0!"},{"$error":"#DIV/0!"},0,0,0,0]
[null,{"$f":"IF(Langue!$A$200 = \"FR\",Dictionnaire!A146,Dictionnaire!B146)","v":"Rangée 6"},null,null,null,null,null,null,null,null,null,null,null,null,null,null,null,null,null,null,null,null,null,null,null,null,null,null,null,null,null,null,null,null,null,"Rangée 6",{"$f":"IF($E$18<6,0,(IF(COUNTIF($C30:$I30,\"PEH\")>0,1,IF(COUNTIF($C30:$I30,\"HPO\")>0,1,0))))","v":0},{"$f":"IF($E$18<6,0,(IF(COUNTIF($C30:$I30,\"FNO\")>0,1,IF(COUNTIF($C30:$I30,\"HWD\")>0,1,0))))","v":0},{"$f":"IF($E$18<6,0,(IF(COUNTIF($C30:$I30,\"CON\")>0,1,IF(COUNTIF($C30:$I30,\"CON\")>0,1,0))))","v":0},{"$f":"IF($E$18<6,0,(IF(COUNTIF($C30:$I30,\"ARB\")>0,1,IF(COUNTIF($C30:$I30,\"SHR\")>0,1,0))))","v":0},{"$f":"IF($E$18<6,0,(IF(COUNTIF($C30:$I30,\"SAH\")>0,1,IF(COUNTIF($C30:$I30,\"HWL\")>0,1,0))))","v":0},{"$f":"IF($E$18<6,0,(COUNTIF($C30:$I30,\"PEH\")+COUNTIF($C30:$I30,\"HPO\")))","v":0},{"$f":"IF($E$18<6,0,(COUNTIF($C30:$I30,\"FNO\")+COUNTIF($C30:$I30,\"HWD\")))","v":0},{"$f":"IF($E$18<6,0,COUNTIF($C30:$I30,\"CON\"))","v":0},{"$f":"IF($E$18<6,0,(COUNTIF($C30:$I30,\"ARB\")+COUNTIF($C30:$I30,\"SHR\")))","v":0},{"$f":"IF($E$18<6,0,COUNTIF($C30:$I30,\"SAH\")+COUNTIF($C30:$I30,\"HWL\"))","v":0},0,{"$error":"#DIV/0!"},{"$error":"#DIV/0!"},0,{"$error":"#DIV/0!"},{"$error":"#DIV/0!"},0,0,0,0]
[null,{"$f":"IF(Langue!$A$200 = \"FR\",Dictionnaire!A147,Dictionnaire!B147)","v":"Rangée 7"},null,null,null,null,null,null,null,null,null,null,null,null,null,null,null,null,null,null,null,null,null,null,null,null,null,null,null,null,null,null,null,null,null,"Rangée 7",{"$f":"IF($E$18<7,0,(IF(COUNTIF($C31:$I31,\"PEH\")>0,1,IF(COUNTIF($C31:$I31,\"HPO\")>0,1,0))))","v":0},{"$f":"IF($E$18<7,0,(IF(COUNTIF($C31:$I31,\"FNO\")>0,1,IF(COUNTIF($C31:$I31,\"HWD\")>0,1,0))))","v":0},{"$f":"IF($E$18<7,0,(IF(COUNTIF($C31:$I31,\"CON\")>0,1,IF(COUNTIF($C31:$I31,\"CON\")>0,1,0))))","v":0},{"$f":"IF($E$18<7,0,(IF(COUNTIF($C31:$I31,\"ARB\")>0,1,IF(COUNTIF($C31:$I31,\"SHR\")>0,1,0))))","v":0},{"$f":"IF($E$18<7,0,(IF(COUNTIF($C31:$I31,\"SAH\")>0,1,IF(COUNTIF($C31:$I31,\"HWL\")>0,1,0))))","v":0},{"$f":"IF($E$18<7,0,(COUNTIF($C31:$I31,\"PEH\")+COUNTIF($C31:$I31,\"HPO\")))","v":0},{"$f":"IF($E$18<7,0,(COUNTIF($C31:$I31,\"FNO\")+COUNTIF($C31:$I31,\"HWD\")))","v":0},{"$f":"IF($E$18<7,0,COUNTIF($C31:$I31,\"CON\"))","v":0},{"$f":"IF($E$18<7,0,(COUNTIF($C31:$I31,\"ARB\")+COUNTIF($C31:$I31,\"SHR\")))","v":0},{"$f":"IF($E$18<7,0,COUNTIF($C31:$I31,\"SAH\")+COUNTIF($C31:$I31,\"HWL\"))","v":0},0,{"$error":"#DIV/0!"},{"$error":"#DIV/0!"},0,{"$error":"#DIV/0!"},{"$error":"#DIV/0!"},0,0,0,0]
[null,null,null,null,null,null,null,null,null,null,null,null,null,null,null,null,null,null,null,null,null,null,null,null,null,null,null,null,null,null,null,null,null,null,"",null,{"$f":"IF(SUM(AK25:AK31)>0,1,\"\")","v":""},{"$f":"IF(SUM(AL25:AL31)>0,1,\"\")","v":""},"","","",null,null,null,null,null,"Recloter bois ou biomasse?"]
[null,{"$f":"IF(Langue!$A$200 = \"FR\",Dictionnaire!A148,Dictionnaire!B148)","v":"Quel est l'espacement entre les végétaux (m) ?"},null,null,null,null,null,null,null,null,null,null,null,null,null,null,null,null,null,null,null,null,null,null,null,null,null,null,null,null,null,null,null,null,null,"R1",{"$f":"IF($C$111=FALSE,\"\",(IF(AK$25=0,\"\",(IF(Langue!$A$200=\"FR\",Dictionnaire!$A$162,Dictionnaire!$B$162)))))","v":""},{"$f":"IF($C$113=FALSE,\"\",(IF(AL$25=0,\"\",(IF(Langue!$A$200=\"FR\",Dictionnaire!$A$162,Dictionnaire!$B$162)))))","v":""},{"$f":"IF($C$112=FALSE,\"\",(IF(AM$25=0,\"\",(IF(Langue!$A$200=\"FR\",Dictionnaire!$A$162,Dictionnaire!$B$162)))))","v":""},{"$f":"IF($C$112=FALSE,\"\",(IF(AN$25=0,\"\",(IF(Langue!$A$200=\"FR\",Dictionnaire!$A$162,Dictionnaire!$B$162)))))","v":""},{"$f":"IF($C$114=FALSE,\"\",(IF(AO$25=0,\"\",(IF(Langue!$A$200=\"FR\",Dictionnaire!$A$162,Dictionnaire!$B$162)))))","v":""},null,null,null,null,null,{"$f":"SUM(AK32,AL32,AM32,AO32)","v":0},{"$f":"(IF(AU$33=0,\"\",(IF(Langue!$A$200=\"FR\",Dictionnaire!$A$162,Dictionnaire!$B$162))))","v":""}]
[null,null,null,null,null,null,null,null,null,null,null,null,null,null,null,null,null,null,null,null,null,null,null,null,null,null,null,null,null,null,null,null,null,null,null,null,{"$f":"IF($C$111=FALSE,\"\",(IF(AK$25=0,\"\",(IF(Langue!$A$200=\"FR\",Dictionnaire!$A$163,Dictionnaire!$B$163)))))","v":""},{"$f":"IF($C$113=FALSE,\"\",(IF(AL$25=0,\"\",(IF(Langue!$A$200=\"FR\",Dictionnaire!$A$163,Dictionnaire!$B$163)))))","v":""},{"$f":"IF($C$112=FALSE,\"\",(IF(AM$25=0,\"\",(IF(Langue!$A$200=\"FR\",Dictionnaire!$A$163,Dictionnaire!$B$163)))))","v":""},{"$f":"IF($C$112=FALSE,\"\",(IF(AN$25=0,\"\",(IF(Langue!$A$200=\"FR\",Dictionnaire!$A$163,Dictionnaire!$B$163)))))","v":""},{"$f":"IF($C$114=FALSE,\"\",(IF(AO$25=0,\"\",(IF(Langue!$A$200=\"FR\",Dictionnaire!$A$163,Dictionnaire!$B$163)))))","v":""},null,null,null,null,null,null,{"$f":"(IF(AU$33=0,\"\",(IF(Langue!$A$200=\"FR\",Dictionnaire!$A$163,Dictionnaire!$B$163))))","v":""}]
[null,{"$f":"IF(Langue!$A$200 = \"FR\",Dictionnaire!A149,Dictionnaire!B149)","v":"Rangée 1"},"0",null,null,null,null,null,null,null,null,null,null,null,null,null,null,null,null,null,null,null,null,null,null,null,null,null,null,null,null,null,null,null,null,"R2",{"$f":"IF($C$111=FALSE,\"\",(IF(AK$26=0,\"\",(IF(Langue!$A$200=\"FR\",Dictionnaire!$A$162,Dictionnaire!$B$162)))))","v":""},{"$f":"IF($C$113=FALSE,\"\",(IF(AL$26=0,\"\",(IF(Langue!$A$200=\"FR\",Dictionnaire!$A$162,Dictionnaire!$B$162)))))","v":""},{"$f":"IF($C$112=FALSE,\"\",(IF(AM$26=0,\"\",(IF(Langue!$A$200=\"FR\",Dictionnaire!$A$162,Dictionnaire!$B$162)))))","v":""},{"$f":"IF($C$112=FALSE,\"\",(IF(AN$26=0,\"\",(IF(Langue!$A$200=\"FR\",Dictionnaire!$A$162,Dictionnaire!$B$162)))))","v":""},{"$f":"IF($C$114=FALSE,\"\",(IF(AO$26=0,\"\",(IF(Langue!$A$200=\"FR\",Dictionnaire!$A$162,Dictionnaire!$B$162)))))","v":""},null,null,null,null,null,null,"Oui"]
[null,{"$f":"IF(Langue!$A$200 = \"FR\",Dictionnaire!A150,Dictionnaire!B150)","v":"Rangée 2"},"0",null,null,null,null,null,null,null,null,null,null,null,null,null,null,null,null,null,null,null,null,null,null,null,null,null,null,null,null,null,null,null,null,null,{"$f":"IF($C$111=FALSE,\"\",(IF(AK$26=0,\"\",(IF(Langue!$A$200=\"FR\",Dictionnaire!$A$163,Dictionnaire!$B$163)))))","v":""},{"$f":"IF($C$113=FALSE,\"\",(IF(AL$26=0,\"\",(IF(Langue!$A$200=\"FR\",Dictionnaire!$A$163,Dictionnaire!$B$163)))))","v":""},{"$f":"IF($C$112=FALSE,\"\",(IF(AM$26=0,\"\",(IF(Langue!$A$200=\"FR\",Dictionnaire!$A$163,Dictionnaire!$B$163)))))","v":""},{"$f":"IF($C$112=FALSE,\"\",(IF(AN$26=0,\"\",(IF(Langue!$A$200=\"FR\",Dictionnaire!$A$163,Dictionnaire!$B$163)))))","v":""},{"$f":"IF($C$114=FALSE,\"\",(IF(AO$26=0,\"\",(IF(Langue!$A$200=\"FR\",Dictionnaire!$A$163,Dictionnaire!$B$163)))))","v":""},null,null,null,null,null,null,"Valeur par défaut",{"$f":"(IF(Langue!$A$200=\"FR\",Dictionnaire!$A$163,Dictionnaire!$B$163))","v":"Non"}]
[null,{"$f":"IF(Langue!$A$200 = \"FR\",Dictionnaire!A151,Dictionnaire!B151)","v":"Rangée 3"},"0",null,null,null,null,null,null,null,null,null,null,null,null,null,null,null,null,null,null,null,null,null,null,null,null,null,null,null,null,null,null,null,null,"R3",{"$f":"IF($C$111=FALSE,\"\",(IF(AK$27=0,\"\",(IF(Langue!$A$200=\"FR\",Dictionnaire!$A$162,Dictionnaire!$B$162)))))","v":""},{"$f":"IF($C$113=FALSE,\"\",(IF(AL$27=0,\"\",(IF(Langue!$A$200=\"FR\",Dictionnaire!$A$162,Dictionnaire!$B$162)))))","v":""},{"$f":"IF($C$112=FALSE,\"\",(IF(AM$27=0,\"\",(IF(Langue!$A$200=\"FR\",Dictionnaire!$A$162,Dictionnaire!$B$162)))))","v":""},{"$f":"IF($C$112=FALSE,\"\",(IF(AN$27=0,\"\",(IF(Langue!$A$200=\"FR\",Dictionnaire!$A$162,Dictionnaire!$B$162)))))","v":""},{"$f":"IF($C$114=FALSE,\"\",(IF(AO$27=0,\"\",(IF(Langue!$A$200=\"FR\",Dictionnaire!$A$162,Dictionnaire!$B$162)))))","v":""}]
[null,{"$f":"IF(Langue!$A$200 = \"FR\",Dictionnaire!A152,Dictionnaire!B152)","v":"Rangée 4"},"0",null,null,null,null,null,null,null,null,null,null,null,null,null,null,null,null,null,null,null,null,null,null,null,null,null,null,null,null,null,null,null,null,null,{"$f":"IF($C$111=FALSE,\"\",(IF(AK$27=0,\"\",(IF(Langue!$A$200=\"FR\",Dictionnaire!$A$163,Dictionnaire!$B$163)))))","v":""},{"$f":"IF($C$113=FALSE,\"\",(IF(AL$27=0,\"\",(IF(Langue!$A$200=\"FR\",Dictionnaire!$A$163,Dictionnaire!$B$163)))))","v":""},{"$f":"IF($C$112=FALSE,\"\",(IF(AM$27=0,\"\",(IF(Langue!$A$200=\"FR\",Dictionnaire!$A$163,Dictionnaire!$B$163)))))","v":""},{"$f":"IF($C$112=FALSE,\"\",(IF(AN$27=0,\"\",(IF(Langue!$A$200=\"FR\",Dictionnaire!$A$163,Dictionnaire!$B$163)))))","v":""},{"$f":"IF($C$114=FALSE,\"\",(IF(AO$27=0,\"\",(IF(Langue!$A$200=\"FR\",Dictionnaire!$A$163,Dictionnaire!$B$163)))))","v":""}]
[null,{"$f":"IF(Langue!$A$200 = \"FR\",Dictionnaire!A153,Dictionnaire!B153)","v":"Rangée 5"},"0",null,null,null,null,null,null,null,null,null,null,null,null,null,null,null,null,null,null,null,null,null,null,null,null,null,null,null,null,null,null,null,null,"R4",{"$f":"IF($C$111=FALSE,\"\",(IF(AK$28=0,\"\",(IF(Langue!$A$200=\"FR\",Dictionnaire!$A$162,Dictionnaire!$B$162)))))","v":""},{"$f":"IF($C$113=FALSE,\"\",(IF(AL$28=0,\"\",(IF(Langue!$A$200=\"FR\",Dictionnaire!$A$162,Dictionnaire!$B$162)))))","v":""},{"$f":"IF($C$112=FALSE,\"\",(IF(AM$28=0,\"\",(IF(Langue!$A$200=\"FR\",Dictionnaire!$A$162,Dictionnaire!$B$162)))))","v":""},{"$f":"IF($C$112=FALSE,\"\",(IF(AN$28=0,\"\",(IF(Langue!$A$200=\"FR\",Dictionnaire!$A$162,Dictionnaire!$B$162)))))","v":""},{"$f":"IF($C$114=FALSE,\"\",(IF(AO$28=0,\"\",(IF(Langue!$A$200=\"FR\",Dictionnaire!$A$162,Dictionnaire!$B$162)))))","v":""}]
[null,{"$f":"IF(Langue!$A$200 = \"FR\",Dictionnaire!A154,Dictionnaire!B154)","v":"Rangée 6"},"0",null,null,null,null,null,null,null,null,null,null,null,null,null,null,null,null,null,null,null,null,null,null,null,null,null,null,null,null,null,null,null,null,null,{"$f":"IF($C$111=FALSE,\"\",(IF(AK$28=0,\"\",(IF(Langue!$A$200=\"FR\",Dictionnaire!$A$163,Dictionnaire!$B$163)))))","v":""},{"$f":"IF($C$113=FALSE,\"\",(IF(AL$28=0,\"\",(IF(Langue!$A$200=\"FR\",Dictionnaire!$A$163,Dictionnaire!$B$163)))))","v":""},{"$f":"IF($C$112=FALSE,\"\",(IF(AM$28=0,\"\",(IF(Langue!$A$200=\"FR\",Dictionnaire!$A$163,Dictionnaire!$B$163)))))","v":""},{"$f":"IF($C$112=FALSE,\"\",(IF(AN$28=0,\"\",(IF(Langue!$A$200=\"FR\",Dictionnaire!$A$163,Dictionnaire!$B$163)))))","v":""},{"$f":"IF($C$114=FALSE,\"\",(IF(AO$28=0,\"\",(IF(Langue!$A$200=\"FR\",Dictionnaire!$A$163,Dictionnaire!$B$163)))))","v":""}]
[null,{"$f":"IF(Langue!$A$200 = \"FR\",Dictionnaire!A155,Dictionnaire!B155)","v":"Rangée 7"},"0",null,null,null,null,null,null,null,null,null,null,null,null,null,null,null,null,null,null,null,null,null,null,null,null,null,null,null,null,null,null,null,null,"R5",{"$f":"IF($C$111=FALSE,\"\",(IF(AK$29=0,\"\",(IF(Langue!$A$200=\"FR\",Dictionnaire!$A$162,Dictionnaire!$B$162)))))","v":""},{"$f":"IF($C$113=FALSE,\"\",(IF(AL$29=0,\"\",(IF(Langue!$A$200=\"FR\",Dictionnaire!$A$162,Dictionnaire!$B$162)))))","v":""},{"$f":"IF($C$112=FALSE,\"\",(IF(AM$29=0,\"\",(IF(Langue!$A$200=\"FR\",Dictionnaire!$A$162,Dictionnaire!$B$162)))))","v":""},{"$f":"IF($C$112=FALSE,\"\",(IF(AN$29=0,\"\",(IF(Langue!$A$200=\"FR\",Dictionnaire!$A$162,Dictionnaire!$B$162)))))","v":""},{"$f":"IF($C$114=FALSE,\"\",(IF(AO$29=0,\"\",(IF(Langue!$A$200=\"FR\",Dictionnaire!$A$162,Dictionnaire!$B$162)))))","v":""}]
[null,null,null,null,null,null,null,null,null,null,null,null,null,null,null,null,null,null,null,null,null,null,null,null,null,null,null,null,null,null,null,null,null,null,null,null,{"$f":"IF($C$111=FALSE,\"\",(IF(AK$29=0,\"\",(IF(Langue!$A$200=\"FR\",Dictionnaire!$A$163,Dictionnaire!$B$163)))))","v":""},{"$f":"IF($C$113=FALSE,\"\",(IF(AL$29=0,\"\",(IF(Langue!$A$200=\"FR\",Dictionnaire!$A$163,Dictionnaire!$B$163)))))","v":""},{"$f":"IF($C$112=FALSE,\"\",(IF(AM$29=0,\"\",(IF(Langue!$A$200=\"FR\",Dictionnaire!$A$163,Dictionnaire!$B$163)))))","v":""},{"$f":"IF($C$112=FALSE,\"\",(IF(AN$29=0,\"\",(IF(Langue!$A$200=\"FR\",Dictionnaire!$A$163,Dictionnaire!$B$163)))))","v":""},{"$f":"IF($C$114=FALSE,\"\",(IF(AO$29=0,\"\",(IF(Langue!$A$200=\"FR\",Dictionnaire!$A$163,Dictionnaire!$B$163)))))","v":""}]
[null,{"$f":"IF(Langue!$A$200 = \"FR\",Dictionnaire!A156,Dictionnaire!B156)","v":"Type de paillis utilisé ?"},null,"Déroulé en longueur",{"$f":"IF(Langue!$A$200 = \"FR\",Dictionnaire!A157,Dictionnaire!B157)","v":"Largeur du plastique si déroulé ?"},null,"4",{"$f":"IF(Langue!$A$200 = \"FR\",Dictionnaire!A158,Dictionnaire!B158)","v":"pieds"},null,null,null,null,null,null,null,null,null,null,null,null,null,null,null,null,null,null,null,null,4,{"$f":"IF(OR($D$43=\"Déroulé en longueur\",$D$43=\"Rolled down\"),4,0)","v":4},null,null,null,null,null,"R6",{"$f":"IF($C$111=FALSE,\"\",(IF(AK$30=0,\"\",(IF(Langue!$A$200=\"FR\",Dictionnaire!$A$162,Dictionnaire!$B$162)))))","v":""},{"$f":"IF($C$113=FALSE,\"\",(IF(AL$30=0,\"\",(IF(Langue!$A$200=\"FR\",Dictionnaire!$A$162,Dictionnaire!$B$162)))))","v":""},{"$f":"IF($C$112=FALSE,\"\",(IF(AM$30=0,\"\",(IF(Langue!$A$200=\"FR\",Dictionnaire!$A$162,Dictionnaire!$B$162)))))","v":""},{"$f":"IF($C$112=FALSE,\"\",(IF(AN$30=0,\"\",(IF(Langue!$A$200=\"FR\",Dictionnaire!$A$162,Dictionnaire!$B$162)))))","v":""},{"$f":"IF($C$114=FALSE,\"\",(IF(AO$30=0,\"\",(IF(Langue!$A$200=\"FR\",Dictionnaire!$A$162,Dictionnaire!$B$162)))))","v":""}]
[null,null,null,null,null,null,null,null,null,null,null,null,null,null,null,null,null,null,null,null,null,null,null,null,null,null,null,null,5,{"$f":"IF(OR($D$43=\"Déroulé en longueur\",$D$43=\"Rolled down\"),5,0)","v":5},null,null,null,null,null,null,{"$f":"IF($C$111=FALSE,\"\",(IF(AK$30=0,\"\",(IF(Langue!$A$200=\"FR\",Dictionnaire!$A$163,Dictionnaire!$B$163)))))","v":""},{"$f":"IF($C$113=FALSE,\"\",(IF(AL$30=0,\"\",(IF(Langue!$A$200=\"FR\",Dictionnaire!$A$163,Dictionnaire!$B$163)))))","v":""},{"$f":"IF($C$112=FALSE,\"\",(IF(AM$30=0,\"\",(IF(Langue!$A$200=\"FR\",Dictionnaire!$A$163,Dictionnaire!$B$163)))))","v":""},{"$f":"IF($C$112=FALSE,\"\",(IF(AN$30=0,\"\",(IF(Langue!$A$200=\"FR\",Dictionnaire!$A$163,Dictionnaire!$B$163)))))","v":""},{"$f":"IF($C$114=FALSE,\"\",(IF(AO$30=0,\"\",(IF(Langue!$A$200=\"FR\",Dictionnaire!$A$163,Dictionnaire!$B$163)))))","v":""}]
[null,null,null,null,null,null,null,null,null,null,null,null,null,null,null,null,null,null,null,null,null,null,null,null,null,null,null,null,{"$f":"IF(Langue!$A$200 = \"FR\",Dictionnaire!A159,Dictionnaire!B159)","v":"Déroulé en longueur"},null,null,null,null,null,null,"R7",{"$f":"IF($C$111=FALSE,\"\",(IF(AK$31=0,\"\",(IF(Langue!$A$200=\"FR\",Dictionnaire!$A$162,Dictionnaire!$B$162)))))","v":""},{"$f":"IF($C$113=FALSE,\"\",(IF(AL$31=0,\"\",(IF(Langue!$A$200=\"FR\",Dictionnaire!$A$162,Dictionnaire!$B$162)))))","v":""},{"$f":"IF($C$112=FALSE,\"\",(IF(AM$31=0,\"\",(IF(Langue!$A$200=\"FR\",Dictionnaire!$A$162,Dictionnaire!$B$162)))))","v":""},{"$f":"IF($C$112=FALSE,\"\",(IF(AN$31=0,\"\",(IF(Langue!$A$200=\"FR\",Dictionnaire!$A$162,Dictionnaire!$B$162)))))","v":""},{"$f":"IF($C$114=FALSE,\"\",(IF(AO$31=0,\"\",(IF(Langue!$A$200=\"FR\",Dictionnaire!$A$162,Dictionnaire!$B$162)))))","v":""}]
[null,{"$f":"IF(Langue!$A$200 = \"FR\",Dictionnaire!A164,Dictionnaire!B164)","v":"Quels sont les coûts des végétaux ($) ?"},null,null,null,null,null,null,null,null,null,null,null,null,null,null,null,null,null,null,null,null,null,null,null,null,null,null,{"$f":"IF(Langue!$A$200 = \"FR\",Dictionnaire!A160,Dictionnaire!B160)","v":"Grandes collerettes"},null,null,null,null,null,null,null,{"$f":"IF($C$111=FALSE,\"\",(IF(AK$31=0,\"\",(IF(Langue!$A$200=\"FR\",Dictionnaire!$A$163,Dictionnaire!$B$163)))))","v":""},{"$f":"IF($C$113=FALSE,\"\",(IF(AL$31=0,\"\",(IF(Langue!$A$200=\"FR\",Dictionnaire!$A$163,Dictionnaire!$B$163)))))","v":""},{"$f":"IF($C$112=FALSE,\"\",(IF(AM$31=0,\"\",(IF(Langue!$A$200=\"FR\",Dictionnaire!$A$163,Dictionnaire!$B$163)))))","v":""},{"$f":"IF($C$112=FALSE,\"\",(IF(AN$31=0,\"\",(IF(Langue!$A$200=\"FR\",Dictionnaire!$A$163,Dictionnaire!$B$163)))))","v":""},{"$f":"IF($C$114=FALSE,\"\",(IF(AO$31=0,\"\",(IF(Langue!$A$200=\"FR\",Dictionnaire!$A$163,Dictionnaire!$B$163)))))","v":""}]
[null,null,null,null,null,null,null,null,null,null,null,null,null,null,null,null,null,null,null,null,null,null,null,null,null,null,null,null,{"$f":"IF(Langue!$A$200 = \"FR\",Dictionnaire!A161,Dictionnaire!B161)","v":"Biodisques"},null,null,null,null,null,null,"Toute",{"$f":"IF($C$111=FALSE,\"\",(IF(SUM(AK25:AK31)=0,\"\",(IF(Langue!$A$200=\"FR\",Dictionnaire!$A$162,Dictionnaire!$B$162)))))","v":""},{"$f":"IF($C$113=FALSE,\"\",(IF(SUM(AL25:AL31)=0,\"\",(IF(Langue!$A$200=\"FR\",Dictionnaire!$A$162,Dictionnaire!$B$162)))))","v":""},{"$f":"IF($C$112=FALSE,\"\",(IF(SUM(AM25:AM31)=0,\"\",(IF(Langue!$A$200=\"FR\",Dictionnaire!$A$162,Dictionnaire!$B$162)))))","v":""},{"$f":"IF($C$112=FALSE,\"\",(IF(SUM(AN25:AN31)=0,\"\",(IF(Langue!$A$200=\"FR\",Dictionnaire!$A$162,Dictionnaire!$B$162)))))","v":""},{"$f":"IF($C$114=FALSE,\"\",(IF(SUM(AO25:AO31)=0,\"\",(IF(Langue!$A$200=\"FR\",Dictionnaire!$A$162,Dictionnaire!$B$162)))))","v":""}]
[null,null,null,{"$f":"IF(Langue!$A$200 = \"FR\",Dictionnaire!A165,Dictionnaire!B165)","v":"Épinettes, Pins ou Thuyas (CON)"},9,null,null,null,null,null,null,null,null,null,null,null,null,null,null,null,null,null,null,null,null,null,null,null,null,0,null,null,null,null,null,null,{"$f":"IF($C$111=FALSE,\"\",(IF(SUM(AK25:AK31)=0,\"\",(IF(Langue!$A$200=\"FR\",Dictionnaire!$A$163,Dictionnaire!$B$163)))))","v":""},{"$f":"IF($C$113=FALSE,\"\",(IF(SUM(AL25:AL31)=0,\"\",(IF(Langue!$A$200=\"FR\",Dictionnaire!$A$163,Dictionnaire!$B$163)))))","v":""},{"$f":"IF($C$112=FALSE,\"\",(IF(SUM(AM25:AM31)=0,\"\",(IF(Langue!$A$200=\"FR\",Dictionnaire!$A$163,Dictionnaire!$B$163)))))","v":""},{"$f":"IF($C$112=FALSE,\"\",(IF(SUM(AN25:AN31)=0,\"\",(IF(Langue!$A$200=\"FR\",Dictionnaire!$A$163,Dictionnaire!$B$163)))))","v":""},{"$f":"IF($C$114=FALSE,\"\",(IF(SUM(AO25:AO31)=0,\"\",(IF(Langue!$A$200=\"FR\",Dictionnaire!$A$163,Dictionnaire!$B$163)))))","v":""}]
[null,null,null,{"$f":"IF(Langue!$A$200 = \"FR\",Dictionnaire!A166,Dictionnaire!B166)","v":"Peupliers hybrides (PEH)"},9,null,null,null,null,null,null,null,null,null,null,null,null,null,null,null,null,null,null,null,null,null,null,null,null,0.25,"Rangée 1","Rangée 2","Rangée 3","Rangée 4","Rangée 5","Rangée 6","Rangée 7"]
[null,null,null,{"$f":"IF(Langue!$A$200 = \"FR\",Dictionnaire!A167,Dictionnaire!B167)","v":"Feuillus nobles (FNO)"},9,null,null,null,null,null,null,null,null,null,null,null,null,null,null,null,null,null,null,null,null,null,null,null,{"$f":"IF(Langue!$A$200 = \"FR\",Dictionnaire!A285,Dictionnaire!B285)","v":"CON"},0.375]
[null,null,null,{"$f":"IF(Langue!$A$200 = \"FR\",Dictionnaire!A168,Dictionnaire!B168)","v":"Arbustes (ARB)"},9,null,null,null,null,null,null,null,null,null,null,null,null,null,null,null,null,null,null,null,null,null,null,null,{"$f":"IF(Langue!$A$200 = \"FR\",Dictionnaire!A286,Dictionnaire!B286)","v":"PEH"},0.5,{"$f":"IF($E$18>=1,$AC50,\"\")","v":""},{"$f":"IF($E$18>=2,$AC50,\"\")","v":""},{"$f":"IF($E$18>=3,$AC50,\"\")","v":""},{"$f":"IF($E$18>=4,$AC50,\"\")","v":""},{"$f":"IF($E$18>=5,$AC50,\"\")","v":""},{"$f":"IF($E$18>=6,$AC50,\"\")","v":""},{"$f":"IF($E$18>=7,$AC50,\"\")","v":""}]
[null,null,null,{"$f":"IF(Langue!$A$200 = \"FR\",Dictionnaire!A169,Dictionnaire!B169)","v":"Saules hybrides (SAH)"},0.5,null,null,null,null,null,null,null,null,null,null,null,null,null,null,null,null,null,null,null,null,null,null,null,{"$f":"IF(Langue!$A$200 = \"FR\",Dictionnaire!A287,Dictionnaire!B287)","v":"FNO"},0.75,{"$f":"IF($E$18>=1,$AC51,\"\")","v":""},{"$f":"IF($E$18>=2,$AC51,\"\")","v":""},{"$f":"IF($E$18>=3,$AC51,\"\")","v":""},{"$f":"IF($E$18>=4,$AC51,\"\")","v":""},{"$f":"IF($E$18>=5,$AC51,\"\")","v":""},{"$f":"IF($E$18>=6,$AC51,\"\")","v":""},{"$f":"IF($E$18>=7,$AC51,\"\")","v":""}]
[null,null,null,null,null,null,null,null,null,null,null,null,null,null,null,null,null,null,null,null,null,null,null,null,null,null,null,null,{"$f":"IF(Langue!$A$200 = \"FR\",Dictionnaire!A288,Dictionnaire!B288)","v":"ARB"},1,{"$f":"IF($E$18>=1,$AC52,\"\")","v":""},{"$f":"IF($E$18>=2,$AC52,\"\")","v":""},{"$f":"IF($E$18>=3,$AC52,\"\")","v":""},{"$f":"IF($E$18>=4,$AC52,\"\")","v":""},{"$f":"IF($E$18>=5,$AC52,\"\")","v":""},{"$f":"IF($E$18>=6,$AC52,\"\")","v":""},{"$f":"IF($E$18>=7,$AC52,\"\")","v":""}]
[null,null,null,null,null,null,null,null,null,null,null,null,null,null,null,null,null,null,null,null,null,null,null,null,null,null,null,null,{"$f":"IF(Langue!$A$200 = \"FR\",Dictionnaire!A289,Dictionnaire!B289)","v":"SAH"},1.5,{"$f":"IF($E$18>=1,$AC53,\"\")","v":""},{"$f":"IF($E$18>=2,$AC53,\"\")","v":""},{"$f":"IF($E$18>=3,$AC53,\"\")","v":""},{"$f":"IF($E$18>=4,$AC53,\"\")","v":""},{"$f":"IF($E$18>=5,$AC53,\"\")","v":""},{"$f":"IF($E$18>=6,$AC53,\"\")","v":""},{"$f":"IF($E$18>=7,$AC53,\"\")","v":""}]
[null,null,null,null,null,null,null,null,null,null,null,null,null,null,null,null,null,null,null,null,null,null,null,null,null,null,null,null,null,2,{"$f":"IF($E$18>=1,$AC54,\"\")","v":""},{"$f":"IF($E$18>=2,$AC54,\"\")","v":""},{"$f":"IF($E$18>=3,$AC54,\"\")","v":""},{"$f":"IF($E$18>=4,$AC54,\"\")","v":""},{"$f":"IF($E$18>=5,$AC54,\"\")","v":""},{"$f":"IF($E$18>=6,$AC54,\"\")","v":""},{"$f":"IF($E$18>=7,$AC54,\"\")","v":""}]
[null,{"$f":"IF(Langue!$A$200 = \"FR\",Dictionnaire!A170,Dictionnaire!B170)","v":"Inscrire la distance entre le site d'établissement et le point de départ des ouvriers"},null,null,null,null,null,0,"km",null,null,null,null,null,null,null,null,null,null,null,null,null,null,null,null,null,null,null,null,3]
[null,null,null,null,null,null,null,null,null,null,null,null,null,null,null,null,null,null,null,null,null,null,null,null,null,null,null,null,null,4]
[null,{"$f":"IF(Langue!$A$200 = \"FR\",Dictionnaire!A171,Dictionnaire!B171)","v":"Subvention (programme Prime-Vert par défaut)"},null,null,null,null,null,0.7,null,null,null,null,null,null,null,null,null,null,null,null,null,null,null,null,null,null,null,null,null,5]
[null,null,null,null,null,null,null,null,null,null,null,null,null,null,null,null,null,null,null,null,null,null,null,null,null,null,null,null,"Choix",6]
[null,{"$f":"IF(Langue!$A$200 = \"FR\",Dictionnaire!A173,Dictionnaire!B173)","v":"Désirez-vous effectuer votre établissement avec des arbres de fort calibre ?"},null,null,null,null,null,"Non",null,null,null,null,null,null,null,null,null,null,null,null,null,null,null,null,null,null,null,null,{"$f":"IF(Langue!$A$200 = \"FR\",Dictionnaire!A162,Dictionnaire!B162)","v":"Oui"}]
[null,null,null,null,null,null,null,null,null,null,null,null,null,null,null,null,null,null,null,null,null,null,null,null,null,null,null,null,{"$f":"IF(Langue!$A$200 = \"FR\",Dictionnaire!A163,Dictionnaire!B163)","v":"Non"},"Rangée 1","Rangée 2","Rangée 3","Rangée 4","Rangée 5","Rangée 6","Rangée 7","Rangée 1","Rangée 2","Rangée 3","Rangée 4","Rangée 5","Rangée 6","Rangée 7"]
[null,{"$f":"IF(Langue!$A$200 = \"FR\",Dictionnaire!A181,Dictionnaire!B181)","v":"Protection contre les ravageurs"},null,null,null,null,null,"Non"]
[]
[null,{"$f":"IF(Langue!$A$200 = \"FR\",Dictionnaire!A182,Dictionnaire!B182)","v":"Si oui, spécifiez lesquels"},null,null,null,false,0,false]
[null,null,null,null,null,null,null,null,null,null,null,null,null,null,null,null,null,null,null,null,null,null,null,null,null,null,null,null,"",{"$f":"IF($E$18<1,\"\",IF(OR($BC$25>=1,$BD$25>=1),\"\",IF(($BA$25+$BB$25)>=2,\"\",IF($AL$25>=1,\"\",$AD$59))))","v":""},{"$f":"IF($E$18<2,\"\",IF(OR($BC$26>=1,$BD$26>=1),\"\",IF(($BB$26+$BA$26)>=2,\"\",IF($AL$26>=1,\"\",$AD$59))))","v":""},{"$f":"IF($E$18<3,\"\",IF(OR($BC$27>=1,$BD$27>=1),\"\",IF(($BB$27+$BA$27)>=2,\"\",IF($AL$27>=1,\"\",$AD$59))))","v":""},{"$f":"IF($E$18<4,\"\",IF(OR($BC$28>=1,$BD$28>=1),\"\",IF(($BB$28+$BA$28)>=2,\"\",IF($AL$28>=1,\"\",$AD$59))))","v":""},{"$f":"IF($E$18<5,\"\",IF(OR($BC$29>=1,$BD$29>=1),\"\",IF(($BB$29+$BA$29)>=2,\"\",IF($AL$29>=1,\"\",$AD$59))))","v":""},{"$f":"IF($E$18<6,\"\",IF(OR($BC$30>=1,$BD$30>=1),\"\",IF(($BB$30+$BA$30)>=2,\"\",IF($AL$30>=1,\"\",$AD$59))))","v":""},{"$f":"IF($E$18<7,\"\",IF(OR($BC$31>=1,$BD$31>=1),\"\",IF(($BB$31+$BA$31)>=2,\"\",IF($AL$31>=1,\"\",$AD$59))))","v":""},{"$f":"CONCATENATE($AC65,AD65)","v":""},"","","","","",""]
[null,{"$f":"IF(Langue!$A$200 = \"FR\",Dictionnaire!A175,Dictionnaire!B175)","v":"Section 2 : Entretien de la haie"},null,null,null,null,null,null,null,null,null,null,null,null,null,null,null,null,null,null,null,null,null,null,null,null,null,null,"",{"$f":"IF($E$18>=1,$AD48,\"\")","v":""},{"$f":"IF($E$18>=2,$AD48,\"\")","v":""},{"$f":"IF($E$18>=3,$AD48,\"\")","v":""},{"$f":"IF($E$18>=4,$AD48,\"\")","v":""},{"$f":"IF($E$18>=5,$AD48,\"\")","v":""},{"$f":"IF($E$18>=6,$AD48,\"\")","v":""},{"$f":"IF($E$18>=7,$AD48,\"\")","v":""},{"$f":"CONCATENATE($AC66,AD66)","v":""},{"$f":"CONCATENATE($AC66,AE66)","v":""},"","","","",""]
[null,null,null,null,null,null,null,null,null,null,null,null,null,null,null,null,null,null,null,null,null,null,null,null,null,null,null,null,"",{"$f":"IF($E$18<1,\"\",IF(OR($BC$25>=1,$BD$25=1),$AD$55,IF(($BA$25+$BB$25)>=2,$AD$54,IF($AL$25>=1,$AD$55,$AD$49))))","v":""},{"$f":"IF($E$18<2,\"\",IF(OR($BC$26>=1,$BD$26=1),$AD$55,IF(($BA$26+$BB$26)>=2,$AD$54,IF($AL$26>=1,$AD$55,$AD$49))))","v":""},{"$f":"IF($E$18<3,\"\",IF(OR($BC$27>=1,$BD$27>=1),$AD$55,IF(($BB$27+$BA$27)>=2,$AD$54,IF($AL$27>=1,$AD$55,$AD$49))))","v":""},{"$f":"IF($E$18<4,\"\",IF(OR($BC$28>=1,$BD$28>=1),$AD$55,IF(($BB$28+$BA$28)>=2,$AD$54,IF($AL$28>=1,$AD$55,$AD$49))))","v":""},{"$f":"IF($E$18<5,\"\",IF(OR($BC$29>=1,$BD$29>=1),$AD$55,IF(($BB$29+$BA$29)>=2,$AD$54,IF($AL$29>=1,$AD$55,$AD$49))))","v":""},{"$f":"IF($E$18<6,\"\",IF(OR($BC$30>=1,$BD$30>=1),$AD$55,IF(($BB$30+$BA$30)>=2,$AD$54,IF($AL$30>=1,$AD$55,$AD$49))))","v":""},{"$f":"IF($E$18<7,\"\",IF(OR($BC$31>=1,$BD$31>=1),$AD$55,IF(($BB$31+$BA$31)>=2,$AD$54,IF($AL$31>=1,$AD$55,$AD$49))))","v":""},{"$f":"CONCATENATE($AC67,AD67)","v":""},"","","","","",""]
[null,{"$f":"IF(Langue!$A$200 = \"FR\",Dictionnaire!A176,Dictionnaire!B176)","v":"Désirez-vous effectuer les activités d'entretien suivantes ?"},null,null,null,{"$f":"IF(Langue!$A$200 = \"FR\",Dictionnaire!A183,Dictionnaire!B183)","v":"Subventions"},"0,7",null,null,null,null,null,null,null,null,null,null,null,null,null,null,null,null,null,null,null,null,null,"",{"$f":"IF($E$18<1,\"\",IF(OR($BC$25>=1,$BD$25>=1),$AD$56,IF(($BA$25+$BB$25)>=2,$AD$55,IF($AL$25>=1,$AD$56,$AD$50))))","v":""},{"$f":"IF($E$18<2,\"\",IF(OR($BC$26>=1,$BD$26>=1),$AD$56,IF(($BA$26+$BB$26)>=2,$AD$55,IF($AL$26>=1,$AD$56,$AD$50))))","v":""},{"$f":"IF($E$18<3,\"\",IF(OR($BC$27>=1,$BD$27>=1),$AD$56,IF(($BB$27+$BA$27)>=2,$AD$55,IF($AL$27>=1,$AD$56,$AD$50))))","v":""},{"$f":"IF($E$18<4,\"\",IF(OR($BC$28>=1,$BD$28>=1),$AD$56,IF(($BB$28+$BA$28)>=2,$AD$55,IF($AL$28>=1,$AD$56,$AD$50))))","v":""},{"$f":"IF($E$18<5,\"\",IF(OR($BC$29>=1,$BD$29>=1),$AD$56,IF(($BB$29+$BA$29)>=2,$AD$55,IF($AL$29>=1,$AD$56,$AD$50))))","v":""},{"$f":"IF($E$18<6,\"\",IF(OR($BC$30>=1,$BD$30>=1),$AD$56,IF(($BB$30+$BA$30)>=2,$AD$55,IF($AL$30>=1,$AD$56,$AD$50))))","v":""},{"$f":"IF($E$18<7,\"\",IF(OR($BC$31>=1,$BD$31>=1),$AD$56,IF(($BB$31+$BA$31)>=2,$AD$55,IF($AL$31>=1,$AD$56,$AD$50))))","v":""},"","","","","","",""]
[null,null,null,null,null,null,null,null,null,null,null,null,null,null,null,null,null,null,null,null,null,null,null,null,null,null,null,null,"",{"$f":"IF($E$18<1,\"\",IF(OR($BC$25>=1,$BD$25>=1),$AD$57,IF(($BA$25+$BB$25)>=2,$AD$56,IF($AL$25>=1,$AD$57,$AD$51))))","v":""},{"$f":"IF($E$18<2,\"\",IF(OR($BC$26>=1,$BD$26>=1),$AD$57,IF(($BB$26+$BA$26)>=2,$AD$56,IF($AL$26>=1,$AD$57,$AD$51))))","v":""},{"$f":"IF($E$18<3,\"\",IF(OR($BC$27>=1,$BD$27>=1),$AD$57,IF(($BB$27+$BA$27)>=2,$AD$56,IF($AL$27>=1,$AD$57,$AD$51))))","v":""},{"$f":"IF($E$18<4,\"\",IF(OR($BC$28>=1,$BD$28>=1),$AD$57,IF(($BB$28+$BA$28)>=2,$AD$56,IF($AL$28>=1,$AD$57,$AD$51))))","v":""},{"$f":"IF($E$18<5,\"\",IF(OR($BC$29>=1,$BD$29>=1),$AD$57,IF(($BB$29+$BA$29)>=2,$AD$56,IF($AL$29>=1,$AD$57,$AD$51))))","v":""},{"$f":"IF($E$18<6,\"\",IF(OR($BC$30>=1,$BD$30>=1),$AD$57,IF(($BB$30+$BA$30)>=2,$AD$56,IF($AL$30>=1,$AD$57,$AD$51))))","v":""},{"$f":"IF($E$18<7,\"\",IF(OR($BC$31>=1,$BD$31>=1),$AD$57,IF(($BB$31+$BA$31)>=2,$AD$56,IF($AL$31>=1,$AD$57,$AD$51))))","v":""},"","","","","","",""]
[null,null,{"$f":"IF(Langue!$A$200 = \"FR\",Dictionnaire!A177,Dictionnaire!B177)","v":"Remplacement des arbres morts la deuxième année"},null,null,null,"Oui",null,null,null,null,null,null,null,null,null,null,null,null,null,null,null,null,null,null,null,null,null,"",{"$f":"IF($E$18<1,\"\",IF(OR($BC$25>=1,$BD$25>=1),$AD$58,IF(($BA$25+$BB$25)>=2,$AD$57,IF($AL$25>=1,$AD$58,$AD$52))))","v":""},{"$f":"IF($E$18<2,\"\",IF(OR($BC$26>=1,$BD$26>=1),$AD$58,IF(($BB$26+$BA$26)>=2,$AD$57,IF($AL$26>=1,$AD$58,$AD$52))))","v":""},{"$f":"IF($E$18<3,\"\",IF(OR($BC$27>=1,$BD$27>=1),$AD$58,IF(($BB$27+$BA$27)>=2,$AD$57,IF($AL$27>=1,$AD$58,$AD$52))))","v":""},{"$f":"IF($E$18<4,\"\",IF(OR($BC$28>=1,$BD$28>=1),$AD$58,IF(($BB$28+$BA$28)>=2,$AD$57,IF($AL$28>=1,$AD$58,$AD$52))))","v":""},{"$f":"IF($E$18<5,\"\",IF(OR($BC$29>=1,$BD$29>=1),$AD$58,IF(($BB$29+$BA$29)>=2,$AD$57,IF($AL$29>=1,$AD$58,$AD$52))))","v":""},{"$f":"IF($E$18<6,\"\",IF(OR($BC$30>=1,$BD$30>=1),$AD$58,IF(($BB$30+$BA$30)>=2,$AD$57,IF($AL$30>=1,$AD$58,$AD$52))))","v":""},{"$f":"IF($E$18<7,\"\",IF(OR($BC$31>=1,$BD$31>=1),$AD$58,IF(($BB$31+$BA$31)>=2,$AD$57,IF($AL$31>=1,$AD$58,$AD$52))))","v":""},"","","","","","",""]
[null,null,null,null,null,null,null,null,null,null,null,null,null,null,null,null,null,null,null,null,null,null,null,null,null,null,null,null,"",{"$f":"IF($E$18<1,\"\",IF(OR($BC$25>=1,$BD$25>=1),$AD$59,IF(($BA$25+$BB$25)>=2,$AD$58,IF($AL$25>=1,$AD$59,$AD$53))))","v":""},{"$f":"IF($E$18<2,\"\",IF(OR($BC$26>=1,$BD$26>=1),$AD$59,IF(($BB$26+$BA$26)>=2,$AD$58,IF($AL$26>=1,$AD$59,$AD$53))))","v":""},{"$f":"IF($E$18<3,\"\",IF(OR($BC$27>=1,$BD$27>=1),$AD$59,IF(($BB$27+$BA$27)>=2,$AD$58,IF($AL$27>=1,$AD$59,$AD$53))))","v":""},{"$f":"IF($E$18<4,\"\",IF(OR($BC$28>=1,$BD$28>=1),$AD$59,IF(($BB$28+$BA$28)>=2,$AD$58,IF($AL$28>=1,$AD$59,$AD$53))))","v":""},{"$f":"IF($E$18<5,\"\",IF(OR($BC$29>=1,$BD$29>=1),$AD$59,IF(($BB$29+$BA$29)>=2,$AD$58,IF($AL$29>=1,$AD$59,$AD$53))))","v":""},{"$f":"IF($E$18<6,\"\",IF(OR($BC$30>=1,$BD$30>=1),$AD$59,IF(($BB$30+$BA$30)>=2,$AD$58,IF($AL$30>=1,$AD$59,$AD$53))))","v":""},{"$f":"IF($E$18<7,\"\",IF(OR($BC$31>=1,$BD$31>=1),$AD$59,IF(($BB$31+$BA$31)>=2,$AD$58,IF($AL$31>=1,$AD$59,$AD$53))))","v":""},"","","","","","",""]
[null,null,{"$f":"IF(Langue!$A$200 = \"FR\",Dictionnaire!A178,Dictionnaire!B178)","v":"Fauchage et inspection phytosanitaire (1 fois par an, 1 à 5 ans)"},null,null,null,"Oui",null,null,null,null,null,null,null,null,null,null,null,null,null,null,null,null,null,null,null,null,null,"",{"$f":"IF($E$18<1,\"\",IF(OR($BC$25>=1,$BD$25>=1),\"\",IF(($BA$25+$BB$25)>=2,$AD$59,IF($AL$25>=1,\"\",$AD$54))))","v":""},{"$f":"IF($E$18<2,\"\",IF(OR($BC$26>=1,$BD$26>=1),\"\",IF(($BB$26+$BA$26)>=2,$AD$59,IF($AL$26>=1,\"\",$AD$54))))","v":""},{"$f":"IF($E$18<3,\"\",IF(OR($BC$27>=1,$BD$27>=1),\"\",IF(($BB$27+$BA$27)>=2,$AD$59,IF($AL$27>=1,\"\",$AD$54))))","v":""},{"$f":"IF($E$18<4,\"\",IF(OR($BC$28>=1,$BD$28>=1),\"\",IF(($BB$28+$BA$28)>=2,$AD$59,IF($AL$28>=1,\"\",$AD$54))))","v":""},{"$f":"IF($E$18<5,\"\",IF(OR($BC$29>=1,$BD$29>=1),\"\",IF(($BB$29+$BA$29)>=2,$AD$59,IF($AL$29>=1,\"\",$AD$54))))","v":""},{"$f":"IF($E$18<6,\"\",IF(OR($BC$30>=1,$BD$30>=1),\"\",IF(($BB$30+$BA$30)>=2,$AD$59,IF($AL$30>=1,\"\",$AD$54))))","v":""},{"$f":"IF($E$18<7,\"\",IF(OR($BC$31>=1,$BD$31>=1),\"\",IF(($BB$31+$BA$31)>=2,$AD$59,IF($AL$31>=1,\"\",$AD$54))))","v":""},"","","","","","",""]
[null,null,null,null,null,null,null,null,null,null,null,null,null,null,null,null,null,null,null,null,null,null,null,null,null,null,null,null,"",{"$f":"IF($E$18<1,\"\",IF(OR($BC$25>=1,$BD$25>=1),\"\",IF(($BA$25+$BB$25)>=2,\"\",IF($AL$25>=1,\"\",$AD$55))))","v":""},{"$f":"IF($E$18<2,\"\",IF(OR($BC$26>=1,$BD$26>=1),\"\",IF(($BB$26+$BA$26)>=2,\"\",IF($AL$26>=1,\"\",$AD$55))))","v":""},{"$f":"IF($E$18<3,\"\",IF(OR($BC$27>=1,$BD$27>=1),\"\",IF(($BB$27+$BA$27)>=2,\"\",IF($AL$27>=1,\"\",$AD$55))))","v":""},{"$f":"IF($E$18<4,\"\",IF(OR($BC$28>=1,$BD$28>=1),\"\",IF(($BB$28+$BA$28)>=2,\"\",IF($AL$28>=1,\"\",$AD$55))))","v":""},{"$f":"IF($E$18<5,\"\",IF(OR($BC$29>=1,$BD$29>=1),\"\",IF(($BB$29+$BA$29)>=2,\"\",IF($AL$29>=1,\"\",$AD$55))))","v":""},{"$f":"IF($E$18<6,\"\",IF(OR($BC$30>=1,$BD$30>=1),\"\",IF(($BB$30+$BA$30)>=2,\"\",IF($AL$30>=1,\"\",$AD$55))))","v":""},{"$f":"IF($E$18<7,\"\",IF(OR($BC$31>=1,$BD$31>=1),\"\",IF(($BB$31+$BA$31)>=2,\"\",IF($AL$31>=1,\"\",$AD$55))))","v":""},"","","","","","",""]
[null,null,{"$f":"IF(Langue!$A$200 = \"FR\",Dictionnaire!A179,Dictionnaire!B179)","v":"Taille de formation et élagage"},null,null,null,"Oui",null,null,null,null,null,null,null,null,null,null,null,null,null,null,null,null,null,null,null,null,null,"",{"$f":"IF($E$18<1,\"\",IF(OR($BC$25>=1,$BD$25>=1),\"\",IF(($BA$25+$BB$25)>=2,\"\",IF($AL$25>=1,\"\",$AD$56))))","v":""},{"$f":"IF($E$18<2,\"\",IF(OR($BC$26>=1,$BD$26>=1),\"\",IF(($BB$26+$BA$26)>=2,\"\",IF($AL$26>=1,\"\",$AD$56))))","v":""},{"$f":"IF($E$18<3,\"\",IF(OR($BC$27>=1,$BD$27>=1),\"\",IF(($BB$27+$BA$27)>=2,\"\",IF($AL$27>=1,\"\",$AD$56))))","v":""},{"$f":"IF($E$18<4,\"\",IF(OR($BC$28>=1,$BD$28>=1),\"\",IF(($BB$28+$BA$28)>=2,\"\",IF($AL$28>=1,\"\",$AD$56))))","v":""},{"$f":"IF($E$18<5,\"\",IF(OR($BC$29>=1,$BD$29>=1),\"\",IF(($BB$29+$BA$29)>=2,\"\",IF($AL$29>=1,\"\",$AD$56))))","v":""},{"$f":"IF($E$18<6,\"\",IF(OR($BC$30>=1,$BD$30>=1),\"\",IF(($BB$30+$BA$30)>=2,\"\",IF($AL$30>=1,\"\",$AD$56))))","v":""},{"$f":"IF($E$18<7,\"\",IF(OR($BC$31>=1,$BD$31>=1),\"\",IF(($BB$31+$BA$31)>=2,\"\",IF($AL$31>=1,\"\",$AD$56))))","v":""},"","","","","","",""]
[null,null,null,null,null,null,null,null,null,null,null,null,null,null,null,null,null,null,null,null,null,null,null,null,null,null,null,null,"",{"$f":"IF($E$18<1,\"\",IF(OR($BC$25>=1,$BD$25>=1),\"\",IF(($BA$25+$BB$25)>=2,\"\",IF($AL$25>=1,\"\",$AD$57))))","v":""},{"$f":"IF($E$18<2,\"\",IF(OR($BC$26>=1,$BD$26>=1),\"\",IF(($BB$26+$BA$26)>=2,\"\",IF($AL$26>=1,\"\",$AD$57))))","v":""},{"$f":"IF($E$18<3,\"\",IF(OR($BC$27>=1,$BD$27>=1),\"\",IF(($BB$27+$BA$27)>=2,\"\",IF($AL$27>=1,\"\",$AD$57))))","v":""},{"$f":"IF($E$18<4,\"\",IF(OR($BC$28>=1,$BD$28>=1),\"\",IF(($BB$28+$BA$28)>=2,\"\",IF($AL$28>=1,\"\",$AD$57))))","v":""},{"$f":"IF($E$18<5,\"\",IF(OR($BC$29>=1,$BD$29>=1),\"\",IF(($BB$29+$BA$29)>=2,\"\",IF($AL$29>=1,\"\",$AD$57))))","v":""},{"$f":"IF($E$18<6,\"\",IF(OR($BC$30>=1,$BD$30>=1),\"\",IF(($BB$30+$BA$30)>=2,\"\",IF($AL$30>=1,\"\",$AD$57))))","v":""},{"$f":"IF($E$18<7,\"\",IF(OR($BC$31>=1,$BD$31>=1),\"\",IF(($BB$31+$BA$31)>=2,\"\",IF($AL$31>=1,\"\",$AD$57))))","v":""},"","","","","","",""]
[null,null,{"$f":"IF(Langue!$A$200 = \"FR\",Dictionnaire!A180,Dictionnaire!B180)","v":"Recépage des arbustes"},null,null,null,"Oui",null,null,null,null,null,null,null,null,null,null,null,null,null,null,null,null,null,null,null,null,null,"",{"$f":"IF($E$18<1,\"\",IF(OR($BC$25>=1,$BD$25>=1),\"\",IF(($BA$25+$BB$25)>=2,\"\",IF($AL$25>=1,\"\",$AD$58))))","v":""},{"$f":"IF($E$18<2,\"\",IF(OR($BC$26>=1,$BD$26>=1),\"\",IF(($BB$26+$BA$26)>=2,\"\",IF($AL$26>=1,\"\",$AD$58))))","v":""},{"$f":"IF($E$18<3,\"\",IF(OR($BC$27>=1,$BD$27>=1),\"\",IF(($BB$27+$BA$27)>=2,\"\",IF($AL$27>=1,\"\",$AD$58))))","v":""},{"$f":"IF($E$18<4,\"\",IF(OR($BC$28>=1,$BD$28>=1),\"\",IF(($BB$28+$BA$28)>=2,\"\",IF($AL$28>=1,\"\",$AD$58))))","v":""},{"$f":"IF($E$18<5,\"\",IF(OR($BC$29>=1,$BD$29>=1),\"\",IF(($BB$29+$BA$29)>=2,\"\",IF($AL$29>=1,\"\",$AD$58))))","v":""},{"$f":"IF($E$18<6,\"\",IF(OR($BC$30>=1,$BD$30>=1),\"\",IF(($BB$30+$BA$30)>=2,\"\",IF($AL$30>=1,\"\",$AD$58))))","v":""},{"$f":"IF($E$18<7,\"\",IF(OR($BC$31>=1,$BD$31>=1),\"\",IF(($BB$31+$BA$31)>=2,\"\",IF($AL$31>=1,\"\",$AD$58))))","v":""},"","","","","","",""]
[null,null,null,null,null,null,null,null,null,null,null,null,null,null,null,null,null,null,null,null,null,null,null,null,null,null,null,null,"Choix subvention",0.7]
[null,{"$f":"IF(Langue!$A$200 = \"FR\",Dictionnaire!A185,Dictionnaire!B185)","v":"Section 3 : Perte d'espace cultivable "},null,null,null,null,null,null,null,null,null,null,null,null,null,null,null,null,null,null,null,null,null,null,null,null,null,null,null,0.9]
[]
[null,{"$f":"CONCATENATE(IF(Langue!$A$200 = \"FR\",Dictionnaire!A186,Dictionnaire!B186),E16,\" m\")","v":"Si la longueur  de la haie est de 0 m"},null,null,null,null,null,null,null,null,null,null,null,null,null,null,null,null,null,null,null,null,null,null,null,null,null,null,"..."]
[null,{"$f":"IF(Langue!$A$200 = \"FR\",Dictionnaire!A187,Dictionnaire!B187)","v":"Quelle est la longueur de la haie implantée dans un champ cultivé ?"},null,null,null,null,0,"m",null,null,null,null,null,null,null,null,null,null,null,null,null,null,null,null,null,null,null,null,{"$f":"Paramètres!F107","v":"Foin"},null,"Liste année"]
[null,null,null,null,null,null,null,null,null,null,null,null,null,null,null,null,null,null,null,null,null,null,null,null,null,null,null,null,{"$f":"Paramètres!F108","v":"Avoine"},null,0,0]
[null,{"$f":"IF(Langue!$A$200 = \"FR\",Dictionnaire!A188,Dictionnaire!B188)","v":"Quelle est la durée de la rotation de culture ?"},null,null,null,null,{"$f":"AF82*1","v":0},{"$f":"IF(Langue!$A$200 = \"FR\",Dictionnaire!A190,Dictionnaire!B190)","v":"ans"},null,null,null,null,null,null,null,null,null,null,null,null,null,null,null,null,null,null,null,null,{"$f":"Paramètres!F109","v":"Avoine biologique"},null,1]
[null,null,null,null,null,null,null,null,null,null,null,null,null,null,null,null,null,null,null,null,null,null,null,null,null,null,null,null,{"$f":"Paramètres!F110","v":"Blé d'alimentation animale"},null,2]
[null,{"$f":"IF(Langue!$A$200 = \"FR\",Dictionnaire!A189,Dictionnaire!B189)","v":"Quelle est la rotation de culture ?"},null,null,null,0,null,null,null,null,null,null,null,null,null,null,null,null,null,null,null,null,null,null,null,null,null,null,{"$f":"Paramètres!F111","v":"Blé d'alimentation humaine"},null,3]
[null,null,null,null,null,null,null,null,null,null,null,null,null,null,null,null,null,null,null,null,null,null,null,null,null,null,null,null,{"$f":"Paramètres!F112","v":"Blé panifiable biologique"},null,4]
[null,{"$f":"IF(Langue!$A$200 = \"FR\",Dictionnaire!A191,Dictionnaire!B191)","v":"1re"},"...",{"$f":"IF(Langue!$A$200 = \"FR\",Dictionnaire!A194,Dictionnaire!B194)","v":"4e"},"...",{"$f":"IF(Langue!$A$200 = \"FR\",Dictionnaire!A197,Dictionnaire!B197)","v":"7e"},"...",{"$f":"IF(Langue!$A$200 = \"FR\",Dictionnaire!A200,Dictionnaire!B200)","v":"10e"},"...",{"$f":"IF(Langue!$A$200 = \"FR\",Dictionnaire!A203,Dictionnaire!B203)","v":"13e"},"...",{"$f":"IF(Langue!$A$200 = \"FR\",Dictionnaire!A206,Dictionnaire!B206)","v":"16e"},"...",{"$f":"IF(Langue!$A$200 = \"FR\",Dictionnaire!A209,Dictionnaire!B209)","v":"19e"},"...",null,null,null,null,null,null,null,null,null,null,null,null,null,{"$f":"Paramètres!F113","v":"Orge d'alimentation animale"},null,5]
[null,{"$f":"IF(Langue!$A$200 = \"FR\",Dictionnaire!A192,Dictionnaire!B192)","v":"2e"},"...",{"$f":"IF(Langue!$A$200 = \"FR\",Dictionnaire!A195,Dictionnaire!B195)","v":"5e"},"...",{"$f":"IF(Langue!$A$200 = \"FR\",Dictionnaire!A198,Dictionnaire!B198)","v":"8e"},"...",{"$f":"IF(Langue!$A$200 = \"FR\",Dictionnaire!A201,Dictionnaire!B201)","v":"11e"},"...",{"$f":"IF(Langue!$A$200 = \"FR\",Dictionnaire!A204,Dictionnaire!B204)","v":"14e"},"...",{"$f":"IF(Langue!$A$200 = \"FR\",Dictionnaire!A207,Dictionnaire!B207)","v":"17e"},"...",{"$f":"IF(Langue!$A$200 = \"FR\",Dictionnaire!A210,Dictionnaire!B210)","v":"20e"},"...",null,null,null,null,null,null,null,null,null,null,null,null,null,{"$f":"Paramètres!F114","v":"Orge biologique"},null,6]
[null,{"$f":"IF(Langue!$A$200 = \"FR\",Dictionnaire!A193,Dictionnaire!B193)","v":"3e"},"...",{"$f":"IF(Langue!$A$200 = \"FR\",Dictionnaire!A196,Dictionnaire!B196)","v":"6e"},"...",{"$f":"IF(Langue!$A$200 = \"FR\",Dictionnaire!A199,Dictionnaire!B199)","v":"9e"},"...",{"$f":"IF(Langue!$A$200 = \"FR\",Dictionnaire!A202,Dictionnaire!B202)","v":"12e"},"...",{"$f":"IF(Langue!$A$200 = \"FR\",Dictionnaire!A205,Dictionnaire!B205)","v":"15e"},"...",{"$f":"IF(Langue!$A$200 = \"FR\",Dictionnaire!A208,Dictionnaire!B208)","v":"18e"},"...",null,null,null,null,null,null,null,null,null,null,null,null,null,null,null,{"$f":"Paramètres!F115","v":"Maïs fourrager"},null,7]
[null,null,null,null,null,null,null,null,null,null,null,null,null,null,null,null,null,null,null,null,null,null,null,null,null,null,null,null,{"$f":"Paramètres!F116","v":"Maïs grain"},null,8]
[null,{"$f":"IF(Langue!$A$200 = \"FR\",Dictionnaire!A212,Dictionnaire!B212)","v":"Section 4 : Chauffage des bâtiments d'élevage"},null,null,null,null,null,null,null,null,null,null,null,null,null,null,null,null,null,null,null,null,null,null,null,null,null,null,{"$f":"Paramètres!F117","v":"Maïs grain biologique"},null,9]
[null,null,null,null,null,null,null,null,null,null,null,null,null,null,null,null,null,null,null,null,null,null,null,null,null,null,null,null,{"$f":"Paramètres!F118","v":"Soya"},null,10]
[null,{"$f":"IF(Langue!$A$200 = \"FR\",Dictionnaire!A213,Dictionnaire!B213)","v":"Quels sont les coûts annuels de chauffage des bâtiments qui seront protégés?"},null,null,null,null,null,0,null,null,null,null,null,null,null,null,null,null,null,null,null,null,null,null,null,null,null,null,{"$f":"Paramètres!F119","v":"Soya alimentation humaine biologique"},null,11]
[null,null,null,null,null,null,null,null,null,null,null,null,null,null,null,null,null,null,null,null,null,null,null,null,null,null,null,null,{"$f":"Paramètres!F120","v":"Canola"},null,12]
[null,{"$f":"IF(Langue!$A$200 = \"FR\",Dictionnaire!A214,Dictionnaire!B214)","v":"Quel est le type de ventilation de votre bâtiment?"},null,null,null,null,false,false,null,null,null,null,null,null,null,null,null,null,null,null,null,null,null,null,null,null,null,null,{"$f":"Paramètres!F121","v":"Canola biologique"},null,13]
[null,null,null,null,null,null,null,null,null,null,null,null,null,null,null,null,null,null,null,null,null,null,null,null,null,null,null,null,{"$f":"Paramètres!F122","v":"Autre 1**"},null,14]
[null,{"$f":"IF(Langue!$A$200 = \"FR\",Dictionnaire!A215,Dictionnaire!B215)","v":"À quel pourcentage s'élèveront les économies de chauffage à la maturité des haies ?"},null,null,null,null,null,0.1,null,null,null,null,null,null,null,null,null,null,null,null,null,null,null,null,null,null,null,null,{"$f":"Paramètres!F123","v":"Autre 2**"},null,15]
[null,null,null,null,null,null,null,null,null,null,null,null,null,null,null,null,null,null,null,null,null,null,null,null,null,null,null,null,{"$f":"Paramètres!F124","v":"Autre 3**"},null,16]
[null,{"$f":"IF(Langue!$A$200 = \"FR\",Dictionnaire!A217,Dictionnaire!B217)","v":"Section 5 : Déneigement"},null,null,null,null,null,null,null,null,null,null,null,null,null,null,null,null,null,null,null,null,null,null,null,null,null,null,{"$f":"Paramètres!F125","v":"Autre 4**"},null,17]
[null,null,null,null,null,null,null,null,null,null,null,null,null,null,null,null,null,null,null,null,null,null,null,null,null,null,null,null,{"$f":"Paramètres!F126","v":"Autre 5**"},null,18]
[null,{"$f":"IF(Langue!$A$200 = \"FR\",Dictionnaire!A218,Dictionnaire!B218)","v":"Combien d'heures par année sont consacrées aux opérations de déneigement dans le secteur qui sera protégé par la haie ?"},null,null,null,null,null,null,null,null,null,null,null,null,null,null,null,null,null,null,null,null,null,null,null,null,null,null,{"$f":"Paramètres!F127","v":"Autre 6**"},null,19]
[null,null,null,null,null,null,null,0,{"$f":"IF(Langue!$A$200 = \"FR\",Dictionnaire!A219,Dictionnaire!B219)","v":"heures"},null,null,null,null,null,null,null,null,null,null,null,null,null,null,null,null,null,null,null,{"$f":"Paramètres!F128","v":"Autre 7**"},null,20]
[null,null,null,null,null,null,null,null,null,null,null,null,null,null,null,null,null,null,null,null,null,null,null,null,null,null,null,null,{"$f":"Paramètres!F129","v":"Autre 8**"}]
[null,{"$f":"IF(Langue!$A$200 = \"FR\",Dictionnaire!A220,Dictionnaire!B220)","v":"Taux horaire pour les opérations de déneigement ?"},null,null,null,null,null,85,{"$f":"IF(Langue!$A$200 = \"FR\",Dictionnaire!A221,Dictionnaire!B221)","v":"$/heures"},null,null,null,null,null,null,null,null,null,null,null,null,null,null,null,null,null,null,null,{"$f":"Paramètres!F130","v":"Autre 9**"}]
[null,null,null,null,null,null,null,null,null,null,null,null,null,null,null,null,null,null,null,null,null,null,null,null,null,null,null,null,{"$f":"Paramètres!F131","v":"Autre 10**"}]
[null,{"$f":"IF(Langue!$A$200 = \"FR\",Dictionnaire!$A$223,Dictionnaire!$B$223)","v":"Section 6 : Récolte de bois"},null,null,null,null,null,null,null,null,null,null,null,null,null,null,null,null,null,null,null,null,null,null,null,null,null,null,{"$f":"Paramètres!F132","v":0}]
[null,null,null,null,null,null,null,null,null,null,null,null,null,null,null,null,null,null,null,null,null,null,null,null,null,null,null,null,{"$f":"Paramètres!F133","v":0}]
[null,{"$f":"IF(Langue!$A$200 = \"FR\",Dictionnaire!A227,Dictionnaire!B227)","v":"Voulez-vous récolter du bois ou de la biomasse?"},null,null,""]
[null,{"$f":"IF(Langue!$A$200 = \"FR\",Dictionnaire!A224,Dictionnaire!B224)","v":"Quelle espèce prévoyez-vous récolter ?"},null,null,null,{"$f":"IF(Langue!$A$200 = \"FR\",Dictionnaire!A225,Dictionnaire!B225)","v":"À quelle fin destinez-vous le bois?"},null,null,{"$f":"IF(Langue!$A$200 = \"FR\",Dictionnaire!A296,Dictionnaire!B296)","v":"Quelle(s) rangée(s) voulez-vous récolter ?"}]
[null,null,null,null,null,null,null,1,2,3,4,5,6,7]
[null,null,false,null,null,"Sciage"]
[null,null,false,null,null,"Sciage",null,null,null,null,null,null,null,null,null,null,null,null,null,null,null,null,null,null,null,null,null,null,"Choix PEH","Choix CON","Choix FNO","Choix SAH"]
[null,null,false,null,null,"Sciage",null,null,null,null,null,null,null,null,null,null,null,null,null,null,null,null,null,null,null,null,null,null,{"$f":"IF(Langue!$A$200 = \"FR\",Dictionnaire!A291,Dictionnaire!B291)","v":"Sciage"},{"$f":"IF(Langue!$A$200 = \"FR\",Dictionnaire!A291,Dictionnaire!B291)","v":"Sciage"},{"$f":"IF(Langue!$A$200 = \"FR\",Dictionnaire!A291,Dictionnaire!B291)","v":"Sciage"},{"$f":"IF(Langue!$A$200 = \"FR\",Dictionnaire!A294,Dictionnaire!B294)","v":"Pâte ou biomasse"}]
[null,null,false,null,null,"Pâte ou biomasse",null,null,null,null,null,null,null,null,null,null,null,null,null,null,null,null,null,null,null,null,null,null,{"$f":"IF(Langue!$A$200 = \"FR\",Dictionnaire!A292,Dictionnaire!B292)","v":"Déroulage"},{"$f":"IF(Langue!$A$200 = \"FR\",Dictionnaire!A294,Dictionnaire!B294)","v":"Pâte ou biomasse"},{"$f":"IF(Langue!$A$200 = \"FR\",Dictionnaire!A292,Dictionnaire!B292)","v":"Déroulage"}]
[null,null,null,null,null,null,null,null,null,null,null,null,null,null,null,null,null,null,null,null,null,null,null,null,null,null,null,null,{"$f":"IF(Langue!$A$200 = \"FR\",Dictionnaire!A294,Dictionnaire!B294)","v":"Pâte ou biomasse"},null,{"$f":"IF(Langue!$A$200 = \"FR\",Dictionnaire!A293,Dictionnaire!B293)","v":"Bois de chauffage"}]
[null,{"$f":"IF(Langue!$A$200 = \"FR\",Dictionnaire!A226,Dictionnaire!B226)","v":"Quel pourcentage de marge brute prévoyez-vous en retirer ?"},null,null,null,null,null,null,null,null,null,null,null,null,null,null,null,null,null,null,null,null,null,null,null,null,null,null,null,null,{"$f":"IF(Langue!$A$200 = \"FR\",Dictionnaire!A294,Dictionnaire!B294)","v":"Pâte ou biomasse"}]
[null,null,null,null,null,{"$f":"IF(Langue!$A$200 = \"FR\",Dictionnaire!A286,Dictionnaire!B286)","v":"PEH"},0.35]
[null,null,null,null,null,{"$f":"IF(Langue!$A$200 = \"FR\",Dictionnaire!A285,Dictionnaire!B285)","v":"CON"},0.35,null,null,null,null,null,null,null,null,null,null,null,null,null,null,null,null,null,null,null,null,null,"Élagage","Taille de form + élagage","Taille de form + élagage"]
[null,null,null,null,null,{"$f":"IF(Langue!$A$200 = \"FR\",Dictionnaire!A287,Dictionnaire!B287)","v":"FNO"},0.35,null,null,null,null,null,null,null,null,null,null,null,null,null,null,null,null,null,null,null,null,null,{"$f":"IF($G$76=\"Oui\",1,IF($G$76=\"Yes\",1,0))","v":1},{"$f":"IF(AND($G$74=\"Oui\",$G$76=\"Oui\"),1,IF(AND($G$74=\"Yes\",$G$76=\"Yes\"),1,0))","v":1},{"$f":"IF(AND($G$74=\"Oui\",$G$76=\"Oui\"),1,IF(AND($G$74=\"Yes\",$G$76=\"Yes\"),1,0))","v":1}]
[null,null,null,null,null,{"$f":"IF(Langue!$A$200 = \"FR\",Dictionnaire!A289,Dictionnaire!B289)","v":"SAH"},0.35,null,null,null,null,null,null,null,null,null,null,null,null,null,null,null,null,null,null,null,null,null,{"$f":"IF($C$111=FALSE,\"\",IF(SUM($AK$25:$AK$31)<1,\"\",IF(AC$119=1,AC113,AC115)))","v":""},{"$f":"IF($C$112=FALSE,\"\",IF(SUM($AM$25:$AM$31)<1,\"\",IF(AD$119=1,AD113,AD114)))","v":""},{"$f":"IF($C$113=FALSE,\"\",IF(SUM($AL$25:$AL$31)<1,\"\",IF(AE$119=1,AE113,AE115)))","v":""},{"$f":"IF($C$114=FALSE,\"\",IF(SUM($AO$25:$AO$31)<1,\"\",AF113))","v":""}]
[null,null,null,null,null,null,null,null,null,null,null,null,null,null,null,null,null,null,null,null,null,null,null,null,null,null,null,null,{"$f":"IF($C$111=FALSE,\"\",IF(SUM($AK$25:$AK$31)<1,\"\",IF(AC$119=1,AC114,\"\")))","v":""},{"$f":"IF($C$112=FALSE,\"\",IF(SUM($AM$25:$AM$31)<1,\"\",IF(AD$119=1,AD114,\"\")))","v":""},{"$f":"IF($C$113=FALSE,\"\",IF(SUM($AL$25:$AL$31)<1,\"\",IF(AE$119=1,AE114,AE116)))","v":""}]
[null,{"$f":"IF(Langue!$A$200 = \"FR\",Dictionnaire!A228,Dictionnaire!B228)","v":"Section 7 : Récolte de petits fruits"},null,null,null,null,null,null,null,null,null,null,null,null,null,null,null,null,null,null,null,null,null,null,null,null,null,null,{"$f":"IF($C$111=FALSE,\"\",IF(SUM($AK$25:$AK$31)<1,\"\",IF(AC$119=1,AC115,\"\")))","v":""},null,{"$f":"IF($C$113=FALSE,\"\",IF(SUM($AL$25:$AL$31)<1,\"\",IF(AE$119=1,AE115,\"\")))","v":""}]
[null,null,null,null,null,null,null,null,null,null,null,null,null,null,null,null,null,null,null,null,null,null,null,null,null,null,null,null,null,null,{"$f":"IF($C$113=FALSE,\"\",IF(SUM($AL$25:$AL$31)<1,\"\",IF(AE$119=1,AE116,\"\")))","v":""}]
[null,{"$f":"IF(Langue!$A$200 = \"FR\",Dictionnaire!A229,Dictionnaire!B229)","v":"Parmi les arbustes que vous désirez établir, quel pourcentage sont des arbustes fruitiers ?"},null,null,null,null,null,0]
[]
[null,{"$f":"IF(Langue!$A$200 = \"FR\",Dictionnaire!A230,Dictionnaire!B230)","v":"Prévoyez-vous récolter des fruits ?"},null,null,null,"Non"]
[]
[]
[null,{"$f":"IF(Langue!$A$200 = \"FR\",Dictionnaire!A231,Dictionnaire!B231)","v":"Si oui, combien de kg par plant ?"},null,null,null,1.25,{"$f":"IF(Langue!$A$200 = \"FR\",Dictionnaire!A232,Dictionnaire!B232)","v":"kg/plant"}]
[]
[null,{"$f":"IF(Langue!$A$200 = \"FR\",Dictionnaire!A233,Dictionnaire!B233)","v":"À quel prix ?"},null,null,null,0.8,"/kg",null,null,null,null,null,null,null,null,null,null,null,null,null,null,null,null,null,null,null,null,null,"Rendement"]
[null,null,null,null,null,null,null,null,null,null,null,null,null,null,null,null,null,null,null,null,null,null,null,null,null,null,null,null,2.5]
[null,{"$f":"IF(Langue!$A$200 = \"FR\",Dictionnaire!A234,Dictionnaire!B234)","v":"Quel pourcentage de marge brute prévoyez-vous en retirer ?"},null,null,null,0.2,null,null,null,null,null,null,null,null,null,null,null,null,null,null,null,null,null,null,null,null,null,null,5]
[null,null,null,null,null,null,null,null,null,null,null,null,null,null,null,null,null,null,null,null,null,null,null,null,null,null,null,null,10]
[null,{"$f":"IF(Langue!$A$200 = \"FR\",Dictionnaire!A236,Dictionnaire!B236)","v":"Section 8 : Pertes de sol "},null,null,null,null,null,null,null,null,null,null,null,null,null,null,null,null,null,null,null,null,null,null,null,null,null,null,"Pertes de sol"]
[null,{"$f":"IF(Langue!$A$200 = \"FR\",Dictionnaire!A237,Dictionnaire!B237)","v":"(Ne s'applique pas à la protection des bâtiments)"},null,null,null,null,null,null,null,null,null,null,null,null,null,null,null,null,null,null,null,null,null,null,null,null,null,null,0]
[null,null,null,null,null,null,null,null,null,null,null,null,null,null,null,null,null,null,null,null,null,null,null,null,null,null,null,null,15]
[null,{"$f":"IF(Langue!$A$200 = \"FR\",Dictionnaire!A238,Dictionnaire!B238)","v":"À combien évaluez-vous la valeur des pertes de sol ?"},null,null,null,"0",{"$f":"IF(Langue!$A$200 = \"FR\",Dictionnaire!A239,Dictionnaire!B239)","v":" $/ha/année"},null,null,null,null,null,null,null,null,null,null,null,null,null,null,null,null,null,null,null,null,null,30]
[null,null,null,null,null,null,null,null,null,null,null,null,null,null,null,null,null,null,null,null,null,null,null,null,null,null,null,null,45]
[]
[null,{"$f":"IF(Langue!$A$200 = \"FR\",Dictionnaire!A241,Dictionnaire!B241)","v":"Section 9 : Amélioration des rendements de culture "}]
[null,{"$f":"IF(Langue!$A$200 = \"FR\",Dictionnaire!A242,Dictionnaire!B242)","v":"(Ne s'applique pas à la protection des bâtiments)"}]
[]
[null,{"$f":"IF(Langue!$A$200 = \"FR\",Dictionnaire!A243,Dictionnaire!B243)","v":"Est-ce que la haie offrira une protection pour les cultures ?"},null,null,null,"Non",null,null,null,null,null,null,null,null,null,null,null,null,null,null,null,null,null,null,null,null,null,null,"Choix multiple H"]
[null,null,null,null,null,null,null,null,null,null,null,null,null,null,null,null,null,null,null,null,null,null,null,null,null,null,null,null,5]
[null,{"$f":"CONCATENATE(IF(Langue!$A$200 = \"FR\",Dictionnaire!A186,Dictionnaire!B186),E16,\" m\")","v":"Si la longueur  de la haie est de 0 m"},null,null,null,null,null,null,null,null,null,null,null,null,null,null,null,null,null,null,null,null,null,null,null,null,null,null,10]
[null,{"$f":"IF(Langue!$A$200 = \"FR\",Dictionnaire!A244,Dictionnaire!B244)","v":"Quelle est la longueur de la haie qui protégera un champ cultivé ?"},null,null,null,null,0,"m",null,null,null,null,null,null,null,null,null,null,null,null,null,null,null,null,null,null,null,null,15]
[null,null,null,null,null,null,null,null,null,null,null,null,null,null,null,null,null,null,null,null,null,null,null,null,null,null,null,null,20]
[null,{"$f":"IF(Langue!$A$200 = \"FR\",Dictionnaire!A245,Dictionnaire!B245)","v":"Sur quel multiple de la hauteur (H) l'augmentation de rendement est-elle perceptible ?"},null,null,null,null,null,"0","H"]
[]
[null,{"$f":"IF(Langue!$A$200 = \"FR\",Dictionnaire!A246,Dictionnaire!B246)","v":"Quel pourcentage d'amélioration de rendement anticipez-vous ?"},null,null,null,2.5,"%"]
[]
[null,{"$f":"IF(Langue!$A$200 = \"FR\",Dictionnaire!A248,Dictionnaire!B248)","v":"Section 10 : Crédits de carbone"},null,null,null,null,null,null," "]
[]
[null,{"$f":"IF(Langue!$A$200 = \"FR\",Dictionnaire!A249,Dictionnaire!B249)","v":"À combien évaluez-vous le prix de la réduction d’une tonne des GES ?"},null,null,null,null,0,{"$f":"IF(Langue!$A$200 = \"FR\",Dictionnaire!A250,Dictionnaire!B250)","v":"/tonne CO2"}]
[]
[]
[]
[]
[]
[]
[]
[]
[]
[]
[]
[]
[]
[]
[]
[]
[]
[]
[]
[]
[]
[]
[]
[]
[]
[]
[]
[]
[]
[]
[]
[]
[]
[]
[]
[]
[]
[]
[]
[]
[]
[]
[]
[]
[]
[]
[]
[]
[]
[]
[]
[]
[]
[]
[]
[]
[]
[]
[]
[]
[]
[]
[null,{"$f":"IF(Langue!$A$200 = \"FR\",Dictionnaire!A252,Dictionnaire!B252)","v":"Informations"}]
[null,{"$f":"IF(Langue!$A$200 = \"FR\",Dictionnaire!A253,Dictionnaire!B253)","v":"Est-ce que la haie offrira une protection pour les cultures ?"}]
[]
[]
[]
[]
[]
[]
[]
[]
[]
[]
[]
[]
[]
[]
[]
[]
[]
[]
[]
[]
[]
[]
[]
[null,{"$f":"IF(Langue!$A$200 = \"FR\",Dictionnaire!A254,Dictionnaire!B254)","v":"Quels sont les coûts annuels de chauffage des bâtiments qui seront protégés?"}]
[]
[null,null,null,null,null,0]
[]
[null,null,null,null,null,0]
[]
[]
[null,{"$f":"IF(Langue!$A$200 = \"FR\",Dictionnaire!A255,Dictionnaire!B255)","v":"Quel est le type de ventilation de votre bâtiment?"}]
[]
[]
[]
[]
[]
[]
[]
[]
[]
[null,{"$f":"IF(Langue!$A$200 = \"FR\",Dictionnaire!A256,Dictionnaire!B256)","v":" À quel pourcentage d'économie s'élèveront les économies de chauffage à la maturité des haies ?"}]
[]
[]
[]
[]
[]
[]
[]
[]
[]
[]
[]
[]
[]
[]
[]
[null,{"$f":"IF(Langue!$A$200 = \"FR\",Dictionnaire!A257,Dictionnaire!B257)","v":"Combien d'heures par année sont consacrées aux opérations de déneigement ?"}]
[]
[]
[]
[]
[]
[]
[]
[]
[]
[]
[]
[]
[]
[]
[]
[]
[]
[null,{"$f":"IF(Langue!$A$200 = \"FR\",Dictionnaire!A258,Dictionnaire!B258)","v":"Taux horaire pour les opérations de déneigement ?"}]
[]
[]
[]
[]
[]
[]
[]
[]
[]
[]
[]
[]
[]
[]
[]
[null,{"$f":"IF(Langue!$A$200 = \"FR\",Dictionnaire!A259,Dictionnaire!B259)","v":"Longueur de la haie (m) ?"}]
[]
[]
[]
[]
[]
[]
[]
[]
[]
[]
[]
[]
[]
[]
[]
[]
[]
[null,{"$f":"IF(Langue!$A$200 = \"FR\",Dictionnaire!A260,Dictionnaire!B260)","v":"Nombre de rangée ? (maximum 7)"}]
[]
[]
[]
[]
[]
[]
[]
[]
[]
[]
[]
[]
[]
[]
[]
[null,{"$f":"IF(Langue!$A$200 = \"FR\",Dictionnaire!A261,Dictionnaire!B261)","v":"Espacement entre les rangées (m) ?"}]
[]
[]
[]
[]
[]
[]
[]
[]
[]
[]
[]
[]
[]
[]
[]
[]
[]
[null,{"$f":"IF(Langue!$A$200 = \"FR\",Dictionnaire!A262,Dictionnaire!B262)","v":"Quels sont les coûts des végétaux ($) ?"}]
[]
[]
[]
[]
[]
[]
[]
[]
[]
[]
[]
[]
[]
[]
[]
[]
[]
[]
[]
[]
[]
[]
[]
[]
[]
[]
[]
[]
[]
[]
[]
[null,{"$f":"IF(Langue!$A$200 = \"FR\",Dictionnaire!A263,Dictionnaire!B263)","v":"Quelle est la séquence d'établissement des arbres et/ou arbustes ?"}]
[]
[]
[]
[]
[]
[]
[]
[]
[]
[]
[]
[]
[]
[]
[]
[]
[]
[null,{"$f":"IF(Langue!$A$200 = \"FR\",Dictionnaire!A264,Dictionnaire!B264)","v":"Inscrire la distance entre le site d'établissement et le point de départ des ouvriers"}]
[]
[]
[]
[]
[]
[]
[]
[]
[]
[]
[]
[]
[]
[]
[]
[]
[]
[null,{"$f":"IF(Langue!$A$200 = \"FR\",Dictionnaire!A265,Dictionnaire!B265)","v":"Quel est l'espacement entre les végétaux (m) ?"}]
[]
[]
[]
[]
[]
[]
[]
[]
[]
[]
[]
[]
[]
[]
[]
[null,{"$f":"IF(Langue!$A$200 = \"FR\",Dictionnaire!A266,Dictionnaire!B266)","v":"Quelle largeur de paillis de plastique utiliserez-vous ?"}]
[]
[]
[]
[]
[]
[]
[]
[]
[]
[]
[]
[]
[]
[]
[]
[]
[]
[null,{"$f":"IF(Langue!$A$200 = \"FR\",Dictionnaire!A267,Dictionnaire!B267)","v":"Quel est le pourcentage des coûts d'établissement qui sera remboursé par des subventions ?"}]
[]
[]
[]
[]
[]
[]
[]
[]
[]
[]
[]
[]
[]
[]
[]
[null,{"$f":"IF(Langue!$A$200 = \"FR\",Dictionnaire!A268,Dictionnaire!B268)","v":"Est-ce que vous voulez effectuer votre établissement avec des arbres de fort calibre ?"}]
[]
[]
[]
[]
[]
[]
[]
[]
[]
[]
[]
[]
[]
[]
[]
[]
[]
[null,{"$f":"IF(Langue!$A$200 = \"FR\",Dictionnaire!A269,Dictionnaire!B269)","v":"Désirez-vous effectuer les activités d'entretiens suivantes ?"}]
[]
[]
[]
[]
[]
[]
[]
[]
[]
[]
[]
[]
[]
[]
[]
[null,"Quel longueur de la haie est implantée dans un champs cultivé ?"]
[]
[]
[]
[]
[]
[]
[]
[]
[]
[]
[]
[]
[]
[]
[]
[]
[]
[]
[]
[]
[]
[]
[]
[]
[]
[null,{"$f":"IF(Langue!$A$200 = \"FR\",Dictionnaire!A270,Dictionnaire!B270)","v":"Quelle est la longueur de la haie implantée dans un champ cultivé ?"}]
[]
[]
[]
[]
[]
[]
[]
[]
[]
[]
[]
[]
[]
[]
[]
[]
[]
[null,{"$f":"IF(Langue!$A$200 = \"FR\",Dictionnaire!A271,Dictionnaire!B271)","v":"Quelle est la durée de la rotation de culture ?"}]
[]
[]
[]
[]
[]
[]
[]
[]
[]
[]
[]
[]
[]
[]
[]
[null,{"$f":"IF(Langue!$A$200 = \"FR\",Dictionnaire!A272,Dictionnaire!B272)","v":"Quelle est la rotation de culture ?"}]
[]
[]
[]
[]
[]
[]
[]
[]
[]
[]
[]
[]
[]
[]
[]
[]
[]
[null,{"$f":"IF(Langue!$A$200 = \"FR\",Dictionnaire!A273,Dictionnaire!B273)","v":"Quel bois prévoyez-vous récolter ?"}]
[]
[]
[]
[]
[]
[]
[]
[]
[]
[]
[]
[]
[]
[]
[]
[null,{"$f":"IF(Langue!$A$200 = \"FR\",Dictionnaire!A274,Dictionnaire!B274)","v":"À quelle fin destinez-vous le bois?"}]
[]
[]
[]
[]
[]
[]
[]
[]
[]
[]
[]
[]
[]
[]
[]
[]
[]
[]
[]
[]
[]
[]
[]
[]
[]
[]
[]
[]
[null,{"$f":"IF(Langue!$A$200 = \"FR\",Dictionnaire!A275,Dictionnaire!B275)","v":"Quel pourcentage de marge brute prévoyez-vous en retirer ?"}]
[]
[]
[]
[]
[]
[]
[]
[]
[]
[]
[]
[]
[null,{"$f":"IF(Langue!$A$200 = \"FR\",Dictionnaire!A276,Dictionnaire!B276)","v":"Parmis les arbustes que vous désirez établir, quel pourcentage sont des arbustes fruitiers ?"}]
[]
[]
[]
[]
[]
[]
[]
[]
[]
[]
[]
[]
[]
[]
[]
[]
[]
[null,{"$f":"IF(Langue!$A$200 = \"FR\",Dictionnaire!A277,Dictionnaire!B277)","v":"Prévoyez-vous de récolter les fruits"}]
[]
[]
[]
[]
[]
[]
[]
[]
[]
[]
[]
[]
[]
[]
[]
[null,{"$f":"IF(Langue!$A$200 = \"FR\",Dictionnaire!A278,Dictionnaire!B278)","v":"Combien de kg par plant prévoyez-vous récolter ?"}]
[]
[]
[]
[]
[]
[]
[]
[]
[]
[]
[]
[]
[]
[]
[]
[]
[]
[null,{"$f":"IF(Langue!$A$200 = \"FR\",Dictionnaire!A279,Dictionnaire!B279)","v":"À quel prix prévoyez-vous vendre les petits fruits ?"}]
[]
[]
[]
[]
[]
[]
[]
[]
[]
[]
[]
[]
[]
[]
[]
[null,{"$f":"IF(Langue!$A$200 = \"FR\",Dictionnaire!A280,Dictionnaire!B280)","v":"Quel pourcentage de marge brute prévoyez-vous en retirer ?"}]
[]
[]
[]
[]
[]
[]
[]
[]
[]
[]
[]
[]
[]
[]
[]
[]
[]
[null,{"$f":"IF(Langue!$A$200 = \"FR\",Dictionnaire!A281,Dictionnaire!B281)","v":"À combien évaluez-vous la valeur des pertes de sol ?"}]
[]
[]
[]
[]
[]
[]
[]
[]
[]
[]
[]
[]
[]
[]
[]
[null,{"$f":"IF(Langue!$A$200 = \"FR\",Dictionnaire!A282,Dictionnaire!B282)","v":"Quel pourcentage d'amélioration de rendement anticipez-vous ?"}]
[]
[]
[]
[]
[]
[]
[]
[]
[]
[]
[]
[]
[]
[]
[]
[]
[]
[null,"À combien évaluez-vous le prix de la réduction d’une tonne des GES ?"]
[]
[]
[]
[]
[null,{"$f":"IF(Langue!$A$200 = \"FR\",Dictionnaire!A283,Dictionnaire!B283)","v":"À combien évaluez-vous le prix de la réduction d’une tonne des GES ?"}]

{"sheet":"Bilan des calculs","index":9,"n_rows":145,"n_cols":14,"rows_kept":145,"cut":false,"hidden":false,"merged":[[16,8,16,12],[4,9,6,11],[4,12,6,12],[12,9,12,10],[14,7,14,8],[12,7,12,8],[12,11,12,12],[13,7,13,8],[13,9,13,10],[144,2,144,6],[144,8,144,12],[12,5,12,6],[12,3,12,4],[8,2,10,2],[8,3,10,4],[11,5,11,6],[11,9,11,10],[32,1,32,5],[83,2,83,6],[13,11,13,12],[14,11,14,12],[13,3,13,4],[83,8,83,12],[14,9,14,10],[13,5,13,6],[1,2,1,12],[8,7,10,8],[11,7,11,8],[8,11,10,12],[11,11,11,12],[11,3,11,4],[2,2,2,12],[4,6,6,6],[4,7,6,7],[8,9,10,10],[4,2,6,5],[8,5,10,6],[97,1,99,4],[97,5,99,5],[97,6,99,6],[14,5,14,6],[14,3,14,4],[33,1,33,5],[16,2,16,6]]}
[]
[null,null,{"$f":"IF(Langue!$A$200 = \"FR\",Dictionnaire!A717,Dictionnaire!B717)","v":"Tableau synthèse"}]
[null,null,{"$f":"IF(Langue!$A$200 = \"FR\",Dictionnaire!A718,Dictionnaire!B718)","v":" (progression de la marge actualisée cumulative)"}]
[]
[null,null,{"$f":"IF(Langue!$A$200 = \"FR\",Dictionnaire!A719,Dictionnaire!B719)","v":"Délai de récupération "},null,null,null,{"$f":"F98","v":"> 40"},{"$f":"G98","v":"ans"},null,{"$f":"IF(Langue!$A$200 = \"FR\",Dictionnaire!A720,Dictionnaire!B720)","v":"Carbone séquestré (tonnes de CO² équivalent) après 40 ans"},null,null,{"$f":"'Crédits carbone'!H42","v":0}]
[]
[]
[]
[null,null,{"$f":"IF(Langue!$A$200 = \"FR\",Dictionnaire!A722,Dictionnaire!B722)","v":"Période"},{"$f":"IF(Langue!$A$200 = \"FR\",Dictionnaire!A723,Dictionnaire!B723)","v":"Améliorations"},null,{"$f":"IF(Langue!$A$200 = \"FR\",Dictionnaire!A724,Dictionnaire!B724)","v":"Détériorations"},null,{"$f":"IF(Langue!$A$200 = \"FR\",Dictionnaire!A725,Dictionnaire!B725)","v":"Marge"},null,{"$f":"IF(Langue!$A$200 = \"FR\",Dictionnaire!A726,Dictionnaire!B726)","v":"Marge actualisée "},null,{"$f":"IF(Langue!$A$200 = \"FR\",Dictionnaire!A727,Dictionnaire!B727)","v":"Marge actualisée cumulative"}]
[]
[]
[null,null,{"$f":"IF(Langue!$A$200 = \"FR\",Dictionnaire!A728,Dictionnaire!B728)","v":"0-5 ans"},{"$f":"SUM('Coûts d''implantation'!C7,'Calcul espace cultivable'!C7,'Entretien des écrans boisés'!C7,'Calcul d''économie de chauffage'!C7,'Calcul d''économie déneigement'!C7,'Calcul du rendement en bois'!C7,'Calcul du rendement en petits f'!C7,'Amélioration de rendement'!C7,'Pertes de sol'!C7,'Crédits carbone'!C7)","v":0},null,{"$f":"SUM('Coûts d''implantation'!E7,'Calcul espace cultivable'!E7,'Entretien des écrans boisés'!E7,'Calcul d''économie de chauffage'!E7,'Calcul d''économie déneigement'!E7,'Calcul du rendement en bois'!E7,'Calcul du rendement en petits f'!E7,'Amélioration de rendement'!E7,'Pertes de sol'!E7,'Crédits carbone'!E7)","v":-90.000000000000014},null,{"$f":"SUM('Coûts d''implantation'!G7,'Calcul espace cultivable'!G7,'Entretien des écrans boisés'!G7,'Calcul d''économie de chauffage'!G7,'Calcul d''économie déneigement'!G7,'Calcul du rendement en bois'!G7,'Calcul du rendement en petits f'!G7,'Amélioration de rendement'!G7,'Pertes de sol'!G7,'Crédits carbone'!G7)","v":-90.000000000000014},null,{"$f":"SUM('Coûts d''implantation'!H7,'Calcul espace cultivable'!H7,'Entretien des écrans boisés'!H7,'Calcul d''économie de chauffage'!H7,'Calcul d''économie déneigement'!H7,'Calcul du rendement en bois'!H7,'Calcul du rendement en petits f'!H7,'Amélioration de rendement'!H7,'Pertes de sol'!H7,'Crédits carbone'!H7)","v":-75.822548140182846},null,{"$f":"SUM('Coûts d''implantation'!I7,'Calcul espace cultivable'!I7,'Entretien des écrans boisés'!I7,'Calcul d''économie de chauffage'!I7,'Calcul d''économie déneigement'!I7,'Calcul du rendement en bois'!I7,'Calcul du rendement en petits f'!I7,'Amélioration de rendement'!I7,'Pertes de sol'!I7,'Crédits carbone'!I7)","v":-75.822548140182846}]
[null,null,{"$f":"IF(Langue!$A$200 = \"FR\",Dictionnaire!A729,Dictionnaire!B729)","v":"5-10 ans"},{"$f":"SUM('Coûts d''implantation'!C9,'Calcul espace cultivable'!C9,'Entretien des écrans boisés'!C9,'Calcul d''économie de chauffage'!C9,'Calcul d''économie déneigement'!C9,'Calcul du rendement en bois'!C9,'Calcul du rendement en petits f'!C9,'Amélioration de rendement'!C9,'Pertes de sol'!C9,'Crédits carbone'!C9)","v":0},null,{"$f":"SUM('Coûts d''implantation'!E9,'Calcul espace cultivable'!E9,'Entretien des écrans boisés'!E9,'Calcul d''économie de chauffage'!E9,'Calcul d''économie déneigement'!E9,'Calcul du rendement en bois'!E9,'Calcul du rendement en petits f'!E9,'Amélioration de rendement'!E9,'Pertes de sol'!E9,'Crédits carbone'!E9)","v":0},null,{"$f":"SUM('Coûts d''implantation'!G9,'Calcul espace cultivable'!G9,'Entretien des écrans boisés'!G9,'Calcul d''économie de chauffage'!G9,'Calcul d''économie déneigement'!G9,'Calcul du rendement en bois'!G9,'Calcul du rendement en petits f'!G9,'Amélioration de rendement'!G9,'Pertes de sol'!G9,'Crédits carbone'!G9)","v":0},null,{"$f":"SUM('Coûts d''implantation'!H9,'Calcul espace cultivable'!H9,'Entretien des écrans boisés'!H9,'Calcul d''économie de chauffage'!H9,'Calcul d''économie déneigement'!H9,'Calcul du rendement en bois'!H9,'Calcul du rendement en petits f'!H9,'Amélioration de rendement'!H9,'Pertes de sol'!H9,'Crédits carbone'!H9)","v":0},null,{"$f":"SUM('Coûts d''implantation'!I9,'Calcul espace cultivable'!I9,'Entretien des écrans boisés'!I9,'Calcul d''économie de chauffage'!I9,'Calcul d''économie déneigement'!I9,'Calcul du rendement en bois'!I9,'Calcul du rendement en petits f'!I9,'Amélioration de rendement'!I9,'Pertes de sol'!I9,'Crédits carbone'!I9)","v":-75.822548140182846}]
[null,null,{"$f":"IF(Langue!$A$200 = \"FR\",Dictionnaire!A730,Dictionnaire!B730)","v":"10-20 ans"},{"$f":"SUM('Coûts d''implantation'!C11,'Calcul espace cultivable'!C11,'Entretien des écrans boisés'!C11,'Calcul d''économie de chauffage'!C11,'Calcul d''économie déneigement'!C11,'Calcul du rendement en bois'!C11,'Calcul du rendement en petits f'!C11,'Amélioration de rendement'!C11,'Pertes de sol'!C11,'Crédits carbone'!C11)","v":0},null,{"$f":"SUM('Coûts d''implantation'!E11,'Calcul espace cultivable'!E11,'Entretien des écrans boisés'!E11,'Calcul d''économie de chauffage'!E11,'Calcul d''économie déneigement'!E11,'Calcul du rendement en bois'!E11,'Calcul du rendement en petits f'!E11,'Amélioration de rendement'!E11,'Pertes de sol'!E11,'Crédits carbone'!E11)","v":0},null,{"$f":"SUM('Coûts d''implantation'!G11,'Calcul espace cultivable'!G11,'Entretien des écrans boisés'!G11,'Calcul d''économie de chauffage'!G11,'Calcul d''économie déneigement'!G11,'Calcul du rendement en bois'!G11,'Calcul du rendement en petits f'!G11,'Amélioration de rendement'!G11,'Pertes de sol'!G11,'Crédits carbone'!G11)","v":0},null,{"$f":"SUM('Coûts d''implantation'!H11,'Calcul espace cultivable'!H11,'Entretien des écrans boisés'!H11,'Calcul d''économie de chauffage'!H11,'Calcul d''économie déneigement'!H11,'Calcul du rendement en bois'!H11,'Calcul du rendement en petits f'!H11,'Amélioration de rendement'!H11,'Pertes de sol'!H11,'Crédits carbone'!H11)","v":0},null,{"$f":"SUM('Coûts d''implantation'!I11,'Calcul espace cultivable'!I11,'Entretien des écrans boisés'!I11,'Calcul d''économie de chauffage'!I11,'Calcul d''économie déneigement'!I11,'Calcul du rendement en bois'!I11,'Calcul du rendement en petits f'!I11,'Amélioration de rendement'!I11,'Pertes de sol'!I11,'Crédits carbone'!I11)","v":-75.822548140182846}]
[null,null,{"$f":"IF(Langue!$A$200 = \"FR\",Dictionnaire!A731,Dictionnaire!B731)","v":"20-40 ans"},{"$f":"SUM('Coûts d''implantation'!C13,'Calcul espace cultivable'!C13,'Entretien des écrans boisés'!C13,'Calcul d''économie de chauffage'!C13,'Calcul d''économie déneigement'!C13,'Calcul du rendement en bois'!C13,'Calcul du rendement en petits f'!C13,'Amélioration de rendement'!C13,'Pertes de sol'!C13,'Crédits carbone'!C13)","v":0},null,{"$f":"SUM('Coûts d''implantation'!E13,'Calcul espace cultivable'!E13,'Entretien des écrans boisés'!E13,'Calcul d''économie de chauffage'!E13,'Calcul d''économie déneigement'!E13,'Calcul du rendement en bois'!E13,'Calcul du rendement en petits f'!E13,'Amélioration de rendement'!E13,'Pertes de sol'!E13,'Crédits carbone'!E13)","v":0},null,{"$f":"SUM('Coûts d''implantation'!G13,'Calcul espace cultivable'!G13,'Entretien des écrans boisés'!G13,'Calcul d''économie de chauffage'!G13,'Calcul d''économie déneigement'!G13,'Calcul du rendement en bois'!G13,'Calcul du rendement en petits f'!G13,'Amélioration de rendement'!G13,'Pertes de sol'!G13,'Crédits carbone'!G13)","v":0},null,{"$f":"SUM('Coûts d''implantation'!H13,'Calcul espace cultivable'!H13,'Entretien des écrans boisés'!H13,'Calcul d''économie de chauffage'!H13,'Calcul d''économie déneigement'!H13,'Calcul du rendement en bois'!H13,'Calcul du rendement en petits f'!H13,'Amélioration de rendement'!H13,'Pertes de sol'!H13,'Crédits carbone'!H13)","v":0},null,{"$f":"SUM('Coûts d''implantation'!I13,'Calcul espace cultivable'!I13,'Entretien des écrans boisés'!I13,'Calcul d''économie de chauffage'!I13,'Calcul d''économie déneigement'!I13,'Calcul du rendement en bois'!I13,'Calcul du rendement en petits f'!I13,'Amélioration de rendement'!I13,'Pertes de sol'!I13,'Crédits carbone'!I13)","v":-75.822548140182846}]
[]
[null,null,{"$f":"IF(Langue!$A$200 = \"FR\",Dictionnaire!A733,Dictionnaire!B733)","v":"Résultats"},null,null,null,null,null,{"$f":"IF(Langue!$A$200 = \"FR\",Dictionnaire!A734,Dictionnaire!B734)","v":"Menus"}]
[]
[]
[]
[]
[]
[]
[]
[]
[]
[]
[]
[]
[]
[]
[]
[]
[]
[]
[]
[]
[]
[]
[]
[]
[]
[]
[]
[]
[]
[]
[]
[]
[]
[]
[]
[]
[]
[]
[]
[]
[]
[]
[]
[]
[]
[]
[]
[]
[]
[]
[]
[]
[]
[]
[]
[]
[]
[]
[]
[]
[]
[]
[]
[]
[]
[]
[]
[]
[]
[]
[]
[]
[]
[]
[]
[]
[]
[]
[]
[]
[null,{"$f":"IF(Langue!$A$200 = \"FR\",Dictionnaire!A736,Dictionnaire!B736)","v":"Délai de récupération"},null,null,null,"> 40",{"$f":"IF(Langue!$A$200 = \"FR\",Dictionnaire!A737,Dictionnaire!B737)","v":"ans"}]
[]
[]
[]
[null,{"$f":"IF(Langue!$A$200 = \"FR\",Dictionnaire!A738,Dictionnaire!B738)","v":"Année"},{"$f":"IF(Langue!$A$200 = \"FR\",Dictionnaire!A739,Dictionnaire!B739)","v":"Marge actualisée de l'année en cours"},{"$f":"IF(Langue!$A$200 = \"FR\",Dictionnaire!A740,Dictionnaire!B740)","v":"Marge actualisée cumulative"},{"$f":"IF(Langue!$A$200 = \"FR\",Dictionnaire!A741,Dictionnaire!B741)","v":"Coûts d'implantation des écrans boisés"},{"$f":"IF(Langue!$A$200 = \"FR\",Dictionnaire!A742,Dictionnaire!B742)","v":"Coûts des pertes d'espace cultivable"},{"$f":"IF(Langue!$A$200 = \"FR\",Dictionnaire!A743,Dictionnaire!B743)","v":"Coûts de l'entretien des écrans boisés"},{"$f":"IF(Langue!$A$200 = \"FR\",Dictionnaire!A744,Dictionnaire!B744)","v":"Réduction des coûts de chauffage des bâtiments"},{"$f":"IF(Langue!$A$200 = \"FR\",Dictionnaire!A745,Dictionnaire!B745)","v":"Réduction des coûts de déneigement"},{"$f":"IF(Langue!$A$200 = \"FR\",Dictionnaire!A746,Dictionnaire!B746)","v":"Revenu en bois"},{"$f":"IF(Langue!$A$200 = \"FR\",Dictionnaire!A747,Dictionnaire!B747)","v":"Revenu en PFNL"},{"$f":"IF(Langue!$A$200 = \"FR\",Dictionnaire!A748,Dictionnaire!B748)","v":"Amélioration de rendements"},{"$f":"IF(Langue!$A$200 = \"FR\",Dictionnaire!A749,Dictionnaire!B749)","v":"Diminution des pertes de sol"},{"$f":"IF(Langue!$A$200 = \"FR\",Dictionnaire!A750,Dictionnaire!B750)","v":"Revenus liés aux crédits carbone"}]
[null,0,0,0,0,0,0,0,0,0,0,0,0,0]
[null,1,{"$f":"SUM(E104:N104)","v":-16.981132075471702},{"$f":"C104","v":-16.981132075471702},{"$f":"'Coûts d''implantation'!H7","v":0},{"$f":"'Calcul espace cultivable'!E114","v":0},{"$f":"'Entretien des écrans boisés'!E100","v":-16.981132075471702},{"$f":"'Calcul d''économie de chauffage'!E100","v":0},{"$f":"'Calcul d''économie déneigement'!E100","v":0},{"$f":"'Calcul du rendement en bois'!E96","v":0},{"$f":"'Calcul du rendement en petits f'!E100","v":0},{"$f":"'Amélioration de rendement'!E114","v":0},{"$f":"'Pertes de sol'!E100","v":0},{"$f":"'Crédits carbone'!E103","v":0}]
[null,2,{"$f":"SUM(E105:N105)","v":-16.019935920256319},{"$f":"D104+C105","v":-33.001067995728022},null,{"$f":"'Calcul espace cultivable'!E115","v":0},{"$f":"'Entretien des écrans boisés'!E101","v":-16.019935920256319},{"$f":"'Calcul d''économie de chauffage'!E101","v":0},{"$f":"'Calcul d''économie déneigement'!E101","v":0},{"$f":"'Calcul du rendement en bois'!E97","v":0},{"$f":"'Calcul du rendement en petits f'!E101","v":0},{"$f":"'Amélioration de rendement'!E115","v":0},{"$f":"'Pertes de sol'!E101","v":0},{"$f":"'Crédits carbone'!E104","v":0}]
[null,3,-15.113147094581432,{"$f":"D105+C106","v":-48.114215090309457},null,{"$f":"'Calcul espace cultivable'!E116","v":0},{"$f":"'Entretien des écrans boisés'!E102","v":-15.113147094581432},{"$f":"'Calcul d''économie de chauffage'!E102","v":0},{"$f":"'Calcul d''économie déneigement'!E102","v":0},{"$f":"'Calcul du rendement en bois'!E98","v":0},{"$f":"'Calcul du rendement en petits f'!E102","v":0},{"$f":"'Amélioration de rendement'!E116","v":0},{"$f":"'Pertes de sol'!E102","v":0},{"$f":"'Crédits carbone'!E105","v":0}]
[null,4,-14.25768593828437,-62.371901028593825,null,{"$f":"'Calcul espace cultivable'!E117","v":0},{"$f":"'Entretien des écrans boisés'!E103","v":-14.25768593828437},{"$f":"'Calcul d''économie de chauffage'!E103","v":0},{"$f":"'Calcul d''économie déneigement'!E103","v":0},{"$f":"'Calcul du rendement en bois'!E99","v":0},{"$f":"'Calcul du rendement en petits f'!E103","v":0},{"$f":"'Amélioration de rendement'!E117","v":0},{"$f":"'Pertes de sol'!E103","v":0},{"$f":"'Crédits carbone'!E106","v":0}]
[null,5,-13.450647111589026,-75.822548140182846,null,{"$f":"'Calcul espace cultivable'!E118","v":0},{"$f":"'Entretien des écrans boisés'!E104","v":-13.450647111589026},{"$f":"'Calcul d''économie de chauffage'!E104","v":0},{"$f":"'Calcul d''économie déneigement'!E104","v":0},{"$f":"'Calcul du rendement en bois'!E100","v":0},{"$f":"'Calcul du rendement en petits f'!E104","v":0},{"$f":"'Amélioration de rendement'!E118","v":0},{"$f":"'Pertes de sol'!E104","v":0},{"$f":"'Crédits carbone'!E107","v":0}]
[null,6,0,-75.822548140182846,null,{"$f":"'Calcul espace cultivable'!E119","v":0},{"$f":"'Entretien des écrans boisés'!E105","v":0},{"$f":"'Calcul d''économie de chauffage'!E105","v":0},{"$f":"'Calcul d''économie déneigement'!E105","v":0},{"$f":"'Calcul du rendement en bois'!E101","v":0},{"$f":"'Calcul du rendement en petits f'!E105","v":0},{"$f":"'Amélioration de rendement'!E119","v":0},{"$f":"'Pertes de sol'!E105","v":0},{"$f":"'Crédits carbone'!E108","v":0}]
[null,7,0,-75.822548140182846,null,{"$f":"'Calcul espace cultivable'!E120","v":0},{"$f":"'Entretien des écrans boisés'!E106","v":0},{"$f":"'Calcul d''économie de chauffage'!E106","v":0},{"$f":"'Calcul d''économie déneigement'!E106","v":0},{"$f":"'Calcul du rendement en bois'!E102","v":0},{"$f":"'Calcul du rendement en petits f'!E106","v":0},{"$f":"'Amélioration de rendement'!E120","v":0},{"$f":"'Pertes de sol'!E106","v":0},{"$f":"'Crédits carbone'!E109","v":0}]
[null,8,0,-75.822548140182846,null,{"$f":"'Calcul espace cultivable'!E121","v":0},{"$f":"'Entretien des écrans boisés'!E107","v":0},{"$f":"'Calcul d''économie de chauffage'!E107","v":0},{"$f":"'Calcul d''économie déneigement'!E107","v":0},{"$f":"'Calcul du rendement en bois'!E103","v":0},{"$f":"'Calcul du rendement en petits f'!E107","v":0},{"$f":"'Amélioration de rendement'!E121","v":0},{"$f":"'Pertes de sol'!E107","v":0},{"$f":"'Crédits carbone'!E110","v":0}]
[null,9,0,-75.822548140182846,null,{"$f":"'Calcul espace cultivable'!E122","v":0},{"$f":"'Entretien des écrans boisés'!E108","v":0},{"$f":"'Calcul d''économie de chauffage'!E108","v":0},{"$f":"'Calcul d''économie déneigement'!E108","v":0},{"$f":"'Calcul du rendement en bois'!E104","v":0},{"$f":"'Calcul du rendement en petits f'!E108","v":0},{"$f":"'Amélioration de rendement'!E122","v":0},{"$f":"'Pertes de sol'!E108","v":0},{"$f":"'Crédits carbone'!E111","v":0}]
[null,10,0,-75.822548140182846,null,{"$f":"'Calcul espace cultivable'!E123","v":0},{"$f":"'Entretien des écrans boisés'!E109","v":0},{"$f":"'Calcul d''économie de chauffage'!E109","v":0},{"$f":"'Calcul d''économie déneigement'!E109","v":0},{"$f":"'Calcul du rendement en bois'!E105","v":0},{"$f":"'Calcul du rendement en petits f'!E109","v":0},{"$f":"'Amélioration de rendement'!E123","v":0},{"$f":"'Pertes de sol'!E109","v":0},{"$f":"'Crédits carbone'!E112","v":0}]
[null,11,0,-75.822548140182846,null,{"$f":"'Calcul espace cultivable'!E124","v":0},{"$f":"'Entretien des écrans boisés'!E110","v":0},{"$f":"'Calcul d''économie de chauffage'!E110","v":0},{"$f":"'Calcul d''économie déneigement'!E110","v":0},{"$f":"'Calcul du rendement en bois'!E106","v":0},{"$f":"'Calcul du rendement en petits f'!E110","v":0},{"$f":"'Amélioration de rendement'!E124","v":0},{"$f":"'Pertes de sol'!E110","v":0},{"$f":"'Crédits carbone'!E113","v":0}]
[null,12,0,-75.822548140182846,null,{"$f":"'Calcul espace cultivable'!E125","v":0},{"$f":"'Entretien des écrans boisés'!E111","v":0},{"$f":"'Calcul d''économie de chauffage'!E111","v":0},{"$f":"'Calcul d''économie déneigement'!E111","v":0},{"$f":"'Calcul du rendement en bois'!E107","v":0},{"$f":"'Calcul du rendement en petits f'!E111","v":0},{"$f":"'Amélioration de rendement'!E125","v":0},{"$f":"'Pertes de sol'!E111","v":0},{"$f":"'Crédits carbone'!E114","v":0}]
[null,13,0,-75.822548140182846,null,{"$f":"'Calcul espace cultivable'!E126","v":0},{"$f":"'Entretien des écrans boisés'!E112","v":0},{"$f":"'Calcul d''économie de chauffage'!E112","v":0},{"$f":"'Calcul d''économie déneigement'!E112","v":0},{"$f":"'Calcul du rendement en bois'!E108","v":0},{"$f":"'Calcul du rendement en petits f'!E112","v":0},{"$f":"'Amélioration de rendement'!E126","v":0},{"$f":"'Pertes de sol'!E112","v":0},{"$f":"'Crédits carbone'!E115","v":0}]
[null,14,0,-75.822548140182846,null,{"$f":"'Calcul espace cultivable'!E127","v":0},{"$f":"'Entretien des écrans boisés'!E113","v":0},{"$f":"'Calcul d''économie de chauffage'!E113","v":0},{"$f":"'Calcul d''économie déneigement'!E113","v":0},{"$f":"'Calcul du rendement en bois'!E109","v":0},{"$f":"'Calcul du rendement en petits f'!E113","v":0},{"$f":"'Amélioration de rendement'!E127","v":0},{"$f":"'Pertes de sol'!E113","v":0},{"$f":"'Crédits carbone'!E116","v":0}]
[null,15,0,-75.822548140182846,null,{"$f":"'Calcul espace cultivable'!E128","v":0},{"$f":"'Entretien des écrans boisés'!E114","v":0},{"$f":"'Calcul d''économie de chauffage'!E114","v":0},{"$f":"'Calcul d''économie déneigement'!E114","v":0},{"$f":"'Calcul du rendement en bois'!E110","v":0},{"$f":"'Calcul du rendement en petits f'!E114","v":0},{"$f":"'Amélioration de rendement'!E128","v":0},{"$f":"'Pertes de sol'!E114","v":0},{"$f":"'Crédits carbone'!E117","v":0}]
[null,16,0,-75.822548140182846,null,{"$f":"'Calcul espace cultivable'!E129","v":0},{"$f":"'Entretien des écrans boisés'!E115","v":0},{"$f":"'Calcul d''économie de chauffage'!E115","v":0},{"$f":"'Calcul d''économie déneigement'!E115","v":0},{"$f":"'Calcul du rendement en bois'!E111","v":0},{"$f":"'Calcul du rendement en petits f'!E115","v":0},{"$f":"'Amélioration de rendement'!E129","v":0},{"$f":"'Pertes de sol'!E115","v":0},{"$f":"'Crédits carbone'!E118","v":0}]
[null,17,0,-75.822548140182846,null,{"$f":"'Calcul espace cultivable'!E130","v":0},{"$f":"'Entretien des écrans boisés'!E116","v":0},{"$f":"'Calcul d''économie de chauffage'!E116","v":0},{"$f":"'Calcul d''économie déneigement'!E116","v":0},{"$f":"'Calcul du rendement en bois'!E112","v":0},{"$f":"'Calcul du rendement en petits f'!E116","v":0},{"$f":"'Amélioration de rendement'!E130","v":0},{"$f":"'Pertes de sol'!E116","v":0},{"$f":"'Crédits carbone'!E119","v":0}]
[null,18,0,-75.822548140182846,null,{"$f":"'Calcul espace cultivable'!E131","v":0},{"$f":"'Entretien des écrans boisés'!E117","v":0},{"$f":"'Calcul d''économie de chauffage'!E117","v":0},{"$f":"'Calcul d''économie déneigement'!E117","v":0},{"$f":"'Calcul du rendement en bois'!E113","v":0},{"$f":"'Calcul du rendement en petits f'!E117","v":0},{"$f":"'Amélioration de rendement'!E131","v":0},{"$f":"'Pertes de sol'!E117","v":0},{"$f":"'Crédits carbone'!E120","v":0}]
[null,19,0,-75.822548140182846,null,{"$f":"'Calcul espace cultivable'!E132","v":0},{"$f":"'Entretien des écrans boisés'!E118","v":0},{"$f":"'Calcul d''économie de chauffage'!E118","v":0},{"$f":"'Calcul d''économie déneigement'!E118","v":0},{"$f":"'Calcul du rendement en bois'!E114","v":0},{"$f":"'Calcul du rendement en petits f'!E118","v":0},{"$f":"'Amélioration de rendement'!E132","v":0},{"$f":"'Pertes de sol'!E118","v":0},{"$f":"'Crédits carbone'!E121","v":0}]
[null,20,0,-75.822548140182846,null,{"$f":"'Calcul espace cultivable'!E133","v":0},{"$f":"'Entretien des écrans boisés'!E119","v":0},{"$f":"'Calcul d''économie de chauffage'!E119","v":0},{"$f":"'Calcul d''économie déneigement'!E119","v":0},{"$f":"'Calcul du rendement en bois'!E115","v":0},{"$f":"'Calcul du rendement en petits f'!E119","v":0},{"$f":"'Amélioration de rendement'!E133","v":0},{"$f":"'Pertes de sol'!E119","v":0},{"$f":"'Crédits carbone'!E122","v":0}]
[null,21,0,-75.822548140182846,null,{"$f":"'Calcul espace cultivable'!E134","v":0},{"$f":"'Entretien des écrans boisés'!E120","v":0},{"$f":"'Calcul d''économie de chauffage'!E120","v":0},{"$f":"'Calcul d''économie déneigement'!E120","v":0},{"$f":"'Calcul du rendement en bois'!E116","v":0},{"$f":"'Calcul du rendement en petits f'!E120","v":0},{"$f":"'Amélioration de rendement'!E134","v":0},{"$f":"'Pertes de sol'!E120","v":0},{"$f":"'Crédits carbone'!E123","v":0}]
[null,22,0,-75.822548140182846,null,{"$f":"'Calcul espace cultivable'!E135","v":0},{"$f":"'Entretien des écrans boisés'!E121","v":0},{"$f":"'Calcul d''économie de chauffage'!E121","v":0},{"$f":"'Calcul d''économie déneigement'!E121","v":0},{"$f":"'Calcul du rendement en bois'!E117","v":0},{"$f":"'Calcul du rendement en petits f'!E121","v":0},{"$f":"'Amélioration de rendement'!E135","v":0},{"$f":"'Pertes de sol'!E121","v":0},{"$f":"'Crédits carbone'!E124","v":0}]
[null,23,0,-75.822548140182846,null,{"$f":"'Calcul espace cultivable'!E136","v":0},{"$f":"'Entretien des écrans boisés'!E122","v":0},{"$f":"'Calcul d''économie de chauffage'!E122","v":0},{"$f":"'Calcul d''économie déneigement'!E122","v":0},{"$f":"'Calcul du rendement en bois'!E118","v":0},{"$f":"'Calcul du rendement en petits f'!E122","v":0},{"$f":"'Amélioration de rendement'!E136","v":0},{"$f":"'Pertes de sol'!E122","v":0},{"$f":"'Crédits carbone'!E125","v":0}]
[null,24,0,-75.822548140182846,null,{"$f":"'Calcul espace cultivable'!E137","v":0},{"$f":"'Entretien des écrans boisés'!E123","v":0},{"$f":"'Calcul d''économie de chauffage'!E123","v":0},{"$f":"'Calcul d''économie déneigement'!E123","v":0},{"$f":"'Calcul du rendement en bois'!E119","v":0},{"$f":"'Calcul du rendement en petits f'!E123","v":0},{"$f":"'Amélioration de rendement'!E137","v":0},{"$f":"'Pertes de sol'!E123","v":0},{"$f":"'Crédits carbone'!E126","v":0}]
[null,25,0,-75.822548140182846,null,{"$f":"'Calcul espace cultivable'!E138","v":0},{"$f":"'Entretien des écrans boisés'!E124","v":0},{"$f":"'Calcul d''économie de chauffage'!E124","v":0},{"$f":"'Calcul d''économie déneigement'!E124","v":0},{"$f":"'Calcul du rendement en bois'!E120","v":0},{"$f":"'Calcul du rendement en petits f'!E124","v":0},{"$f":"'Amélioration de rendement'!E138","v":0},{"$f":"'Pertes de sol'!E124","v":0},{"$f":"'Crédits carbone'!E127","v":0}]
[null,26,0,-75.822548140182846,null,{"$f":"'Calcul espace cultivable'!E139","v":0},{"$f":"'Entretien des écrans boisés'!E125","v":0},{"$f":"'Calcul d''économie de chauffage'!E125","v":0},{"$f":"'Calcul d''économie déneigement'!E125","v":0},{"$f":"'Calcul du rendement en bois'!E121","v":0},{"$f":"'Calcul du rendement en petits f'!E125","v":0},{"$f":"'Amélioration de rendement'!E139","v":0},{"$f":"'Pertes de sol'!E125","v":0},{"$f":"'Crédits carbone'!E128","v":0}]
[null,27,0,-75.822548140182846,null,{"$f":"'Calcul espace cultivable'!E140","v":0},{"$f":"'Entretien des écrans boisés'!E126","v":0},{"$f":"'Calcul d''économie de chauffage'!E126","v":0},{"$f":"'Calcul d''économie déneigement'!E126","v":0},{"$f":"'Calcul du rendement en bois'!E122","v":0},{"$f":"'Calcul du rendement en petits f'!E126","v":0},{"$f":"'Amélioration de rendement'!E140","v":0},{"$f":"'Pertes de sol'!E126","v":0},{"$f":"'Crédits carbone'!E129","v":0}]
[null,28,0,-75.822548140182846,null,{"$f":"'Calcul espace cultivable'!E141","v":0},{"$f":"'Entretien des écrans boisés'!E127","v":0},{"$f":"'Calcul d''économie de chauffage'!E127","v":0},{"$f":"'Calcul d''économie déneigement'!E127","v":0},{"$f":"'Calcul du rendement en bois'!E123","v":0},{"$f":"'Calcul du rendement en petits f'!E127","v":0},{"$f":"'Amélioration de rendement'!E141","v":0},{"$f":"'Pertes de sol'!E127","v":0},{"$f":"'Crédits carbone'!E130","v":0}]
[null,29,0,-75.822548140182846,null,{"$f":"'Calcul espace cultivable'!E142","v":0},{"$f":"'Entretien des écrans boisés'!E128","v":0},{"$f":"'Calcul d''économie de chauffage'!E128","v":0},{"$f":"'Calcul d''économie déneigement'!E128","v":0},{"$f":"'Calcul du rendement en bois'!E124","v":0},{"$f":"'Calcul du rendement en petits f'!E128","v":0},{"$f":"'Amélioration de rendement'!E142","v":0},{"$f":"'Pertes de sol'!E128","v":0},{"$f":"'Crédits carbone'!E131","v":0}]
[null,30,0,-75.822548140182846,null,{"$f":"'Calcul espace cultivable'!E143","v":0},{"$f":"'Entretien des écrans boisés'!E129","v":0},{"$f":"'Calcul d''économie de chauffage'!E129","v":0},{"$f":"'Calcul d''économie déneigement'!E129","v":0},{"$f":"'Calcul du rendement en bois'!E125","v":0},{"$f":"'Calcul du rendement en petits f'!E129","v":0},{"$f":"'Amélioration de rendement'!E143","v":0},{"$f":"'Pertes de sol'!E129","v":0},{"$f":"'Crédits carbone'!E132","v":0}]
[null,31,0,-75.822548140182846,null,{"$f":"'Calcul espace cultivable'!E144","v":0},{"$f":"'Entretien des écrans boisés'!E130","v":0},{"$f":"'Calcul d''économie de chauffage'!E130","v":0},{"$f":"'Calcul d''économie déneigement'!E130","v":0},{"$f":"'Calcul du rendement en bois'!E126","v":0},{"$f":"'Calcul du rendement en petits f'!E130","v":0},{"$f":"'Amélioration de rendement'!E144","v":0},{"$f":"'Pertes de sol'!E130","v":0},{"$f":"'Crédits carbone'!E133","v":0}]
[null,32,0,-75.822548140182846,null,{"$f":"'Calcul espace cultivable'!E145","v":0},{"$f":"'Entretien des écrans boisés'!E131","v":0},{"$f":"'Calcul d''économie de chauffage'!E131","v":0},{"$f":"'Calcul d''économie déneigement'!E131","v":0},{"$f":"'Calcul du rendement en bois'!E127","v":0},{"$f":"'Calcul du rendement en petits f'!E131","v":0},{"$f":"'Amélioration de rendement'!E145","v":0},{"$f":"'Pertes de sol'!E131","v":0},{"$f":"'Crédits carbone'!E134","v":0}]
[null,33,0,-75.822548140182846,null,{"$f":"'Calcul espace cultivable'!E146","v":0},{"$f":"'Entretien des écrans boisés'!E132","v":0},{"$f":"'Calcul d''économie de chauffage'!E132","v":0},{"$f":"'Calcul d''économie déneigement'!E132","v":0},{"$f":"'Calcul du rendement en bois'!E128","v":0},{"$f":"'Calcul du rendement en petits f'!E132","v":0},{"$f":"'Amélioration de rendement'!E146","v":0},{"$f":"'Pertes de sol'!E132","v":0},{"$f":"'Crédits carbone'!E135","v":0}]
[null,34,0,-75.822548140182846,null,{"$f":"'Calcul espace cultivable'!E147","v":0},{"$f":"'Entretien des écrans boisés'!E133","v":0},{"$f":"'Calcul d''économie de chauffage'!E133","v":0},{"$f":"'Calcul d''économie déneigement'!E133","v":0},{"$f":"'Calcul du rendement en bois'!E129","v":0},{"$f":"'Calcul du rendement en petits f'!E133","v":0},{"$f":"'Amélioration de rendement'!E147","v":0},{"$f":"'Pertes de sol'!E133","v":0},{"$f":"'Crédits carbone'!E136","v":0}]
[null,35,0,-75.822548140182846,null,{"$f":"'Calcul espace cultivable'!E148","v":0},{"$f":"'Entretien des écrans boisés'!E134","v":0},{"$f":"'Calcul d''économie de chauffage'!E134","v":0},{"$f":"'Calcul d''économie déneigement'!E134","v":0},{"$f":"'Calcul du rendement en bois'!E130","v":0},{"$f":"'Calcul du rendement en petits f'!E134","v":0},{"$f":"'Amélioration de rendement'!E148","v":0},{"$f":"'Pertes de sol'!E134","v":0},{"$f":"'Crédits carbone'!E137","v":0}]
[null,36,0,-75.822548140182846,null,{"$f":"'Calcul espace cultivable'!E149","v":0},{"$f":"'Entretien des écrans boisés'!E135","v":0},{"$f":"'Calcul d''économie de chauffage'!E135","v":0},{"$f":"'Calcul d''économie déneigement'!E135","v":0},{"$f":"'Calcul du rendement en bois'!E131","v":0},{"$f":"'Calcul du rendement en petits f'!E135","v":0},{"$f":"'Amélioration de rendement'!E149","v":0},{"$f":"'Pertes de sol'!E135","v":0},{"$f":"'Crédits carbone'!E138","v":0}]
[null,37,0,-75.822548140182846,null,{"$f":"'Calcul espace cultivable'!E150","v":0},{"$f":"'Entretien des écrans boisés'!E136","v":0},{"$f":"'Calcul d''économie de chauffage'!E136","v":0},{"$f":"'Calcul d''économie déneigement'!E136","v":0},{"$f":"'Calcul du rendement en bois'!E132","v":0},{"$f":"'Calcul du rendement en petits f'!E136","v":0},{"$f":"'Amélioration de rendement'!E150","v":0},{"$f":"'Pertes de sol'!E136","v":0},{"$f":"'Crédits carbone'!E139","v":0}]
[null,38,0,-75.822548140182846,null,{"$f":"'Calcul espace cultivable'!E151","v":0},{"$f":"'Entretien des écrans boisés'!E137","v":0},{"$f":"'Calcul d''économie de chauffage'!E137","v":0},{"$f":"'Calcul d''économie déneigement'!E137","v":0},{"$f":"'Calcul du rendement en bois'!E133","v":0},{"$f":"'Calcul du rendement en petits f'!E137","v":0},{"$f":"'Amélioration de rendement'!E151","v":0},{"$f":"'Pertes de sol'!E137","v":0},{"$f":"'Crédits carbone'!E140","v":0}]
[null,39,0,-75.822548140182846,null,{"$f":"'Calcul espace cultivable'!E152","v":0},{"$f":"'Entretien des écrans boisés'!E138","v":0},{"$f":"'Calcul d''économie de chauffage'!E138","v":0},{"$f":"'Calcul d''économie déneigement'!E138","v":0},{"$f":"'Calcul du rendement en bois'!E134","v":0},{"$f":"'Calcul du rendement en petits f'!E138","v":0},{"$f":"'Amélioration de rendement'!E152","v":0},{"$f":"'Pertes de sol'!E138","v":0},{"$f":"'Crédits carbone'!E141","v":0}]
[null,40,0,-75.822548140182846,null,{"$f":"'Calcul espace cultivable'!E153","v":0},{"$f":"'Entretien des écrans boisés'!E139","v":0},{"$f":"'Calcul d''économie de chauffage'!E139","v":0},{"$f":"'Calcul d''économie déneigement'!E139","v":0},{"$f":"'Calcul du rendement en bois'!E135","v":0},{"$f":"'Calcul du rendement en petits f'!E139","v":0},{"$f":"'Amélioration de rendement'!E153","v":0},{"$f":"'Pertes de sol'!E139","v":0},{"$f":"'Crédits carbone'!E142","v":0}]
[]
[null,null,{"$f":"IF(Langue!$A$200 = \"FR\",Dictionnaire!A733,Dictionnaire!B733)","v":"Résultats"},null,null,null,null,null,{"$f":"IF(Langue!$A$200 = \"FR\",Dictionnaire!A734,Dictionnaire!B734)","v":"Menus"}]

{"sheet":"Graphique coûts-revenus","index":10,"n_rows":114,"n_cols":36,"rows_kept":114,"cut":false,"hidden":false,"merged":[[68,28,68,29],[68,30,68,31],[68,32,68,33],[68,34,68,35],[66,34,67,35],[1,1,2,8],[66,28,67,29],[66,30,67,31],[66,32,67,33],[21,1,21,4],[21,5,21,8],[55,1,55,4],[55,5,55,8],[81,32,82,33],[81,34,82,35],[78,32,78,33],[78,34,78,35],[71,28,72,29],[71,30,72,31],[71,32,72,33],[71,34,72,35],[73,34,73,35],[73,28,73,29],[73,30,73,31],[73,32,73,33],[81,28,82,29],[81,30,82,31],[91,28,92,29],[91,30,92,31],[91,32,92,33],[91,34,92,35],[76,28,77,29],[76,30,77,31],[76,32,77,33],[76,34,77,35],[83,32,83,33],[78,28,78,29],[78,30,78,31],[83,34,83,35],[88,28,88,29],[88,30,88,31],[88,32,88,33],[88,34,88,35],[83,28,83,29],[101,34,102,35],[98,32,98,33],[98,34,98,35],[83,30,83,31],[96,32,97,33],[96,34,97,35],[96,28,97,29],[96,30,97,31],[86,32,87,33],[86,34,87,35],[93,28,93,29],[93,30,93,31],[93,32,93,33],[86,28,87,29],[86,30,87,31],[103,28,103,29],[103,30,103,31],[103,32,103,33],[103,34,103,35],[93,34,93,35],[101,28,102,29],[101,30,102,31],[98,28,98,29],[98,30,98,31],[101,32,102,33],[106,28,107,29],[106,30,107,31],[106,32,107,33],[106,34,107,35],[108,28,108,29],[108,30,108,31],[108,32,108,33],[108,34,108,35],[113,28,113,29],[113,30,113,31],[113,32,113,33],[113,34,113,35],[111,32,112,33],[111,34,112,35],[111,28,112,29],[111,30,112,31]]}
[]
[]
[]
[]
[]
[]
[]
[]
[]
[]
[]
[]
[]
[]
[]
[]
[]
[]
[]
[]
[]
[null,{"$f":"IF(Langue!$A$200 = \"FR\",Dictionnaire!A733,Dictionnaire!B733)","v":"Résultats"},null,null,null,"Menus"]
[]
[]
[]
[]
[]
[]
[]
[]
[]
[]
[]
[]
[]
[]
[]
[]
[]
[]
[]
[]
[]
[]
[]
[]
[]
[]
[]
[]
[null,null,null,null,null,null,null,null,null,null,null,null,null,null,null,null,null,null,null,null,null,null,null,null,null,null,null,null,null,null,null,"Coûts"]
[null,null,null,null,null,null,null,null,null,null,null,null,null,null,null,null,null,null,null,null,null,null,null,null,null,null,null,null,null,null,"Total des coûts",{"$f":"SUM(AF53:AF55)","v":-75.822548140182846},{"$f":"SUM(AG53:AG55)","v":1}]
[null,null,null,null,null,null,null,null,null,null,null,null,null,null,null,null,null,null,null,null,null,null,null,null,null,null,null,null,null,null,{"$f":"IF(Langue!$A$200 = \"FR\",Dictionnaire!A700,Dictionnaire!B700)","v":"Coûts liés à l'implantation des écrans boisés"},{"$f":"AI69","v":0},{"$f":"AF53/AF52","v":0}]
[null,null,{"$f":"IF(Langue!$A$200 = \"FR\",Dictionnaire!A712,Dictionnaire!B712)","v":"Revenus en bois non actualisés"},{"$f":"'Calcul du rendement en bois'!C136","v":0},null,null,null,null,null,null,null,null,null,null,null,null,null,null,null,null,null,null,null,null,null,null,null,null,null,null,{"$f":"IF(Langue!$A$200 = \"FR\",Dictionnaire!A701,Dictionnaire!B701)","v":"Coûts liés aux pertes d'espace cultivable"},{"$f":"AI74","v":0},{"$f":"AF54/AF52","v":0}]
[null,null,null,null,null,null,null,null,null,null,null,null,null,null,null,null,null,null,null,null,null,null,null,null,null,null,null,null,null,null,{"$f":"IF(Langue!$A$200 = \"FR\",Dictionnaire!A702,Dictionnaire!B702)","v":"Coûts liés à l'entretien des écrans boisés"},{"$f":"AI79","v":-75.822548140182846},{"$f":"AF55/AF52","v":1},null,"Marge",{"$f":"AF52+AF58","v":-75.822548140182846}]
[null,{"$f":"IF(Langue!$A$200 = \"FR\",Dictionnaire!A733,Dictionnaire!B733)","v":"Résultats"},null,null,null,"Menus"]
[null,null,null,null,null,null,null,null,null,null,null,null,null,null,null,null,null,null,null,null,null,null,null,null,null,null,null,null,null,null,null,"Bénéfices"]
[null,null,null,null,null,null,null,null,null,null,null,null,null,null,null,null,null,null,null,null,null,null,null,null,null,null,null,null,null,null,"Total des bénéfices",{"$f":"SUM(AF59:AF65)","v":0},{"$f":"SUM(AG59:AG65)","v":{"$error":"#DIV/0!"}}]
[null,null,null,null,null,null,null,null,null,null,null,null,null,null,null,null,null,null,null,null,null,null,null,null,null,null,null,null,null,null,{"$f":"IF(Langue!$A$200 = \"FR\",Dictionnaire!A704,Dictionnaire!B704)","v":"Revenus liés aux économies de chauffage"},{"$f":"AI84","v":0},{"$f":"AF59/AF58","v":{"$error":"#DIV/0!"}}]
[null,null,null,null,null,null,null,null,null,null,null,null,null,null,null,null,null,null,null,null,null,null,null,null,null,null,null,null,null,null,{"$f":"IF(Langue!$A$200 = \"FR\",Dictionnaire!A705,Dictionnaire!B705)","v":"Revenus liés aux économies de déneigement"},{"$f":"AI89","v":0},{"$f":"AF60/AF58","v":{"$error":"#DIV/0!"}}]
[null,null,null,null,null,null,null,null,null,null,null,null,null,null,null,null,null,null,null,null,null,null,null,null,null,null,null,null,null,null,{"$f":"IF(Langue!$A$200 = \"FR\",Dictionnaire!A706,Dictionnaire!B706)","v":"Revenus liés à la production de petits fruits"},{"$f":"AI99","v":0},{"$f":"AF61/AF58","v":{"$error":"#DIV/0!"}}]
[null,null,null,null,null,null,null,null,null,null,null,null,null,null,null,null,null,null,null,null,null,null,null,null,null,null,null,null,null,null,{"$f":"IF(Langue!$A$200 = \"FR\",Dictionnaire!A707,Dictionnaire!B707)","v":"Revenus liés à la récolte du bois"},{"$f":"AI94","v":0},{"$f":"AF62/AF58","v":{"$error":"#DIV/0!"}}]
[null,null,null,null,null,null,null,null,null,null,null,null,null,null,null,null,null,null,null,null,null,null,null,null,null,null,null,null,null,null,{"$f":"IF(Langue!$A$200 = \"FR\",Dictionnaire!A708,Dictionnaire!B708)","v":"Revenus liés à l'augmentation de rendement"},{"$f":"AI104","v":0},{"$f":"AF63/AF58","v":{"$error":"#DIV/0!"}}]
[null,null,null,null,null,null,null,null,null,null,null,null,null,null,null,null,null,null,null,null,null,null,null,null,null,null,null,null,null,null,{"$f":"IF(Langue!$A$200 = \"FR\",Dictionnaire!A709,Dictionnaire!B709)","v":"Économies liées diminutions de pertes de sol"},{"$f":"AI109","v":0},{"$f":"AF64/AF58","v":{"$error":"#DIV/0!"}}]
[null,null,null,null,null,null,null,null,null,null,null,null,null,null,null,null,null,null,null,null,null,null,null,null,null,null,null,null,null,null,{"$f":"IF(Langue!$A$200 = \"FR\",Dictionnaire!A710,Dictionnaire!B710)","v":"Revenus liés aux crédits carbone"},{"$f":"AI114","v":0},{"$f":"AF65/AF58","v":{"$error":"#DIV/0!"}}]
[]
[null,null,null,null,null,null,null,null,null,null,null,null,null,null,null,null,null,null,null,null,null,null,null,null,null,null,null,null,"Coûts cumulatifs actualisés liés à l'implantation à 5 ans",null,"Coûts cumulatifs actualisés liés à l'implantation à 10 ans",null,"Coûts cumulatifs actualisés liés à l'implantation à 20 ans",null,"Coûts cumulatifs actualisés liés à l'implantation à 40 ans"]
[]
[null,null,null,null,null,null,null,null,null,null,null,null,null,null,null,null,null,null,null,null,null,null,null,null,null,null,null,null,{"$f":"'Coûts d''implantation'!$F$104","v":0},null,{"$f":"'Coûts d''implantation'!$G$109","v":0},null,{"$f":"'Coûts d''implantation'!$G$119","v":0},null,{"$f":"'Coûts d''implantation'!$G$139","v":0}]
[]
[]
[null,null,null,null,null,null,null,null,null,null,null,null,null,null,null,null,null,null,null,null,null,null,null,null,null,null,null,null,"Pertes cumulatives actualisées liées à l'espace cultivable à 5 ans",null,"Pertes cumulatives actualisées liées à l'espace cultivable à 10 ans",null,"Pertes cumulatives actualisées liées à l'espace cultivable à 20 ans",null,"Pertes cumulatives actualisées liées à l'espace cultivable à 40 ans"]
[]
[null,null,null,null,null,null,null,null,null,null,null,null,null,null,null,null,null,null,null,null,null,null,null,null,null,null,null,null,{"$f":"'Calcul espace cultivable'!$F$118","v":0},null,{"$f":"'Calcul espace cultivable'!$G$123","v":0},null,{"$f":"'Calcul espace cultivable'!$G$133","v":0},null,{"$f":"'Calcul espace cultivable'!$G$153","v":0}]
[]
[]
[null,null,null,null,null,null,null,null,null,null,null,null,null,null,null,null,null,null,null,null,null,null,null,null,null,null,null,null,"Coûts cumulatifs actualisés liés à l'entretien à 5 ans",null,"Coûts cumulatifs actualisés liés à l'entretien à 10 ans",null,"Coûts cumulatifs actualisés liés à l'entretien à 20 ans",null,"Coûts cumulatifs actualisés liés à l'entretien à 40 ans"]
[]
[null,null,null,null,null,null,null,null,null,null,null,null,null,null,null,null,null,null,null,null,null,null,null,null,null,null,null,null,{"$f":"'Entretien des écrans boisés'!$F$104","v":-75.822548140182846},null,{"$f":"'Entretien des écrans boisés'!$G$109","v":-75.822548140182846},null,{"$f":"'Entretien des écrans boisés'!$G$119","v":-75.822548140182846},null,{"$f":"'Entretien des écrans boisés'!$G$139","v":-75.822548140182846}]
[]
[]
[null,null,null,null,null,null,null,null,null,null,null,null,null,null,null,null,null,null,null,null,null,null,null,null,null,null,null,null,"Économies cumulatives actualisées liées au chauffage à 5 ans",null,"Économies cumulatives actualisées liées au chauffage à 10 ans",null,"Économies cumulatives actualisées liées au chauffage à 20 ans",null,"Économies cumulatives actualisées liées au chauffage à 40 ans"]
[]
[null,null,null,null,null,null,null,null,null,null,null,null,null,null,null,null,null,null,null,null,null,null,null,null,null,null,null,null,{"$f":"'Calcul d''économie de chauffage'!$F$104","v":0},null,{"$f":"'Calcul d''économie de chauffage'!$G$109","v":0},null,{"$f":"'Calcul d''économie de chauffage'!$G$119","v":0},null,{"$f":"'Calcul d''économie de chauffage'!$G$139","v":0}]
[]
[]
[null,null,null,null,null,null,null,null,null,null,null,null,null,null,null,null,null,null,null,null,null,null,null,null,null,null,null,null,"Économies cumulatives actualisées liées au déneigement à 5 ans",null,"Économies cumulatives actualisées liées au déneigement à 10 ans",null,"Économies cumulatives actualisées liées au déneigement à 20 ans",null,"Économies cumulatives actualisées liées au déneigement à 40 ans"]
[]
[null,null,null,null,null,null,null,null,null,null,null,null,null,null,null,null,null,null,null,null,null,null,null,null,null,null,null,null,{"$f":"'Calcul d''économie déneigement'!$F$104","v":0},null,{"$f":"'Calcul d''économie déneigement'!$G$109","v":0},null,{"$f":"'Calcul d''économie déneigement'!$G$119","v":0},null,{"$f":"'Calcul d''économie déneigement'!$G$139","v":0}]
[]
[]
[null,null,null,null,null,null,null,null,null,null,null,null,null,null,null,null,null,null,null,null,null,null,null,null,null,null,null,null,"Revenus cumulatifs actualisés liés au bois à 5 ans",null,"Revenus cumulatifs actualisés liés au bois à 10 ans",null,"Revenus cumulatifs actualisés liés au bois à 20 ans",null,"Revenus cumulatifs actualisés liés au bois à 40 ans"]
[]
[null,null,null,null,null,null,null,null,null,null,null,null,null,null,null,null,null,null,null,null,null,null,null,null,null,null,null,null,{"$f":"'Calcul du rendement en bois'!$F$14","v":0},null,{"$f":"'Calcul du rendement en bois'!$G$105","v":0},null,{"$f":"'Calcul du rendement en bois'!$G$115","v":0},null,{"$f":"'Calcul du rendement en bois'!$G$135","v":0}]
[]
[]
[null,null,null,null,null,null,null,null,null,null,null,null,null,null,null,null,null,null,null,null,null,null,null,null,null,null,null,null,"Revenus cumulatifs actualisés liés aux petits fruits à 5 ans",null,"Revenus cumulatifs actualisés liés aux petits fruits à 10 ans",null,"Revenus cumulatifs actualisés liés aux petits fruits à 20 ans",null,"Revenus cumulatifs actualisés liés aux petits fruits à 40 ans"]
[]
[null,null,null,null,null,null,null,null,null,null,null,null,null,null,null,null,null,null,null,null,null,null,null,null,null,null,null,null,{"$f":"'Calcul du rendement en petits f'!$F$104","v":0},null,{"$f":"'Calcul du rendement en petits f'!$G$109","v":0},null,{"$f":"'Calcul du rendement en petits f'!$G$119","v":0},null,{"$f":"'Calcul du rendement en petits f'!$G$139","v":0}]
[]
[]
[null,null,null,null,null,null,null,null,null,null,null,null,null,null,null,null,null,null,null,null,null,null,null,null,null,null,null,null,"Revenus liés à l'augmentation de rendement actualisés à 5 ans",null,"Revenus liés à l'augmentation de rendement actualisés à 10 ans",null,"Revenus liés à l'augmentation de rendement actualisés à 20 ans",null,"Revenus liés à l'augmentation de rendement actualisés à 40 ans"]
[]
[null,null,null,null,null,null,null,null,null,null,null,null,null,null,null,null,null,null,null,null,null,null,null,null,null,null,null,null,{"$f":"'Amélioration de rendement'!F118","v":0},null,{"$f":"'Amélioration de rendement'!G123","v":0},null,{"$f":"'Amélioration de rendement'!G133","v":0},null,{"$f":"'Amélioration de rendement'!G153","v":0}]
[]
[]
[null,null,null,null,null,null,null,null,null,null,null,null,null,null,null,null,null,null,null,null,null,null,null,null,null,null,null,null,"Revenus cumulatifs actualisés liés pertes de sol à 5 ans",null,"Revenus cumulatifs actualisés liés aux pertes de sol à 10 ans",null,"Revenus cumulatifs actualisés liés aux pertes de sol à 20 ans",null,"Revenus cumulatifs actualisés liés aux pertes de sol à 40 ans"]
[]
[null,null,null,null,null,null,null,null,null,null,null,null,null,null,null,null,null,null,null,null,null,null,null,null,null,null,null,null,{"$f":"'Pertes de sol'!F104","v":0},null,{"$f":"'Pertes de sol'!G109","v":0},null,{"$f":"'Pertes de sol'!G119","v":0},null,{"$f":"'Pertes de sol'!G139","v":0}]
[]
[]
[null,null,null,null,null,null,null,null,null,null,null,null,null,null,null,null,null,null,null,null,null,null,null,null,null,null,null,null,"Revenus cumulatifs actualisés liés aux crédits carbone à 5 ans",null,"Revenus cumulatifs actualisés liés aux crédits carbone à 10 ans",null,"Revenus cumulatifs actualisés liés aux crédits carbone à 20 ans",null,"Revenus cumulatifs actualisés liés aux crédits carbone à 40 ans"]
[]
[null,null,null,null,null,null,null,null,null,null,null,null,null,null,null,null,null,null,null,null,null,null,null,null,null,null,null,null,{"$f":"'Crédits carbone'!F107","v":0},null,{"$f":"'Crédits carbone'!G112","v":0},null,{"$f":"'Crédits carbone'!G122","v":0},null,{"$f":"'Crédits carbone'!G142","v":0}]

{"sheet":"Graphique marge actualisée","index":11,"n_rows":44,"n_cols":31,"rows_kept":44,"cut":false,"hidden":false,"merged":[[1,1,2,8],[21,1,21,4],[21,5,21,8]]}
[]
[null,null,null,null,null,null,null,null,null,null,null,null,null,null,null,null,null,null,null,null,null,null,null,null,null,null,null,null,"Année","Marge actualisée de l'année en cours","Marge actualisée cumulative"]
[null,null,null,null,null,null,null,null,null,null,null,null,null,null,null,null,null,null,null,null,null,null,null,null,null,null,null,null,null,"($)","($)"]
[null,null,null,null,null,null,null,null,null,null,null,null,null,null,null,null,null,null,null,null,null,null,null,null,null,null,null,null,0,0,0]
[null,null,null,null,null,null,null,null,null,null,null,null,null,null,null,null,null,null,null,null,null,null,null,null,null,null,null,null,1,{"$f":"'Bilan des calculs'!C104","v":-16.981132075471702},{"$f":"'Bilan des calculs'!D104","v":-16.981132075471702}]
[null,null,null,null,null,null,null,null,null,null,null,null,null,null,null,null,null,null,null,null,null,null,null,null,null,null,null,null,2,{"$f":"'Bilan des calculs'!C105","v":-16.019935920256319},{"$f":"'Bilan des calculs'!D105","v":-33.001067995728022}]
[null,null,null,null,null,null,null,null,null,null,null,null,null,null,null,null,null,null,null,null,null,null,null,null,null,null,null,null,3,{"$f":"'Bilan des calculs'!C106","v":-15.113147094581432},{"$f":"'Bilan des calculs'!D106","v":-48.114215090309457}]
[null,null,null,null,null,null,null,null,null,null,null,null,null,null,null,null,null,null,null,null,null,null,null,null,null,null,null,null,4,{"$f":"'Bilan des calculs'!C107","v":-14.25768593828437},{"$f":"'Bilan des calculs'!D107","v":-62.371901028593825}]
[null,null,null,null,null,null,null,null,null,null,null,null,null,null,null,null,null,null,null,null,null,null,null,null,null,null,null,null,5,{"$f":"'Bilan des calculs'!C108","v":-13.450647111589026},{"$f":"'Bilan des calculs'!D108","v":-75.822548140182846}]
[null,null,null,null,null,null,null,null,null,null,null,null,null,null,null,null,null,null,null,null,null,null,null,null,null,null,null,null,6,{"$f":"'Bilan des calculs'!C109","v":0},{"$f":"'Bilan des calculs'!D109","v":-75.822548140182846}]
[null,null,null,null,null,null,null,null,null,null,null,null,null,null,null,null,null,null,null,null,null,null,null,null,null,null,null,null,7,{"$f":"'Bilan des calculs'!C110","v":0},{"$f":"'Bilan des calculs'!D110","v":-75.822548140182846}]
[null,null,null,null,null,null,null,null,null,null,null,null,null,null,null,null,null,null,null,null,null,null,null,null,null,null,null,null,8,{"$f":"'Bilan des calculs'!C111","v":0},{"$f":"'Bilan des calculs'!D111","v":-75.822548140182846}]
[null,null,null,null,null,null,null,null,null,null,null,null,null,null,null,null,null,null,null,null,null,null,null,null,null,null,null,null,9,{"$f":"'Bilan des calculs'!C112","v":0},{"$f":"'Bilan des calculs'!D112","v":-75.822548140182846}]
[null,null,null,null,null,null,null,null,null,null,null,null,null,null,null,null,null,null,null,null,null,null,null,null,null,null,null,null,10,{"$f":"'Bilan des calculs'!C113","v":0},{"$f":"'Bilan des calculs'!D113","v":-75.822548140182846}]
[null,null,null,null,null,null,null,null,null,null,null,null,null,null,null,null,null,null,null,null,null,null,null,null,null,null,null,null,11,{"$f":"'Bilan des calculs'!C114","v":0},{"$f":"'Bilan des calculs'!D114","v":-75.822548140182846}]
[null,null,null,null,null,null,null,null,null,null,null,null,null,null,null,null,null,null,null,null,null,null,null,null,null,null,null,null,12,{"$f":"'Bilan des calculs'!C115","v":0},{"$f":"'Bilan des calculs'!D115","v":-75.822548140182846}]
[null,null,null,null,null,null,null,null,null,null,null,null,null,null,null,null,null,null,null,null,null,null,null,null,null,null,null,null,13,{"$f":"'Bilan des calculs'!C116","v":0},{"$f":"'Bilan des calculs'!D116","v":-75.822548140182846}]
[null,null,null,null,null,null,null,null,null,null,null,null,null,null,null,null,null,null,null,null,null,null,null,null,null,null,null,null,14,{"$f":"'Bilan des calculs'!C117","v":0},{"$f":"'Bilan des calculs'!D117","v":-75.822548140182846}]
[null,null,null,null,null,null,null,null,null,null,null,null,null,null,null,null,null,null,null,null,null,null,null,null,null,null,null,null,15,{"$f":"'Bilan des calculs'!C118","v":0},{"$f":"'Bilan des calculs'!D118","v":-75.822548140182846}]
[null,null,null,null,null,null,null,null,null,null,null,null,null,null,null,null,null,null,null,null,null,null,null,null,null,null,null,null,16,{"$f":"'Bilan des calculs'!C119","v":0},{"$f":"'Bilan des calculs'!D119","v":-75.822548140182846}]
[null,null,null,null,null,null,null,null,null,null,null,null,null,null,null,null,null,null,null,null,null,null,null,null,null,null,null,null,17,{"$f":"'Bilan des calculs'!C120","v":0},{"$f":"'Bilan des calculs'!D120","v":-75.822548140182846}]
[null,{"$f":"IF(Langue!$A$200 = \"FR\",Dictionnaire!A733,Dictionnaire!B733)","v":"Résultats"},null,null,null,"Menus",null,null,null,null,null,null,null,null,null,null,null,null,null,null,null,null,null,null,null,null,null,null,18,{"$f":"'Bilan des calculs'!C121","v":0},{"$f":"'Bilan des calculs'!D121","v":-75.822548140182846}]
[null,null,null,null,null,null,null,null,null,null,null,null,null,null,null,null,null,null,null,null,null,null,null,null,null,null,null,null,19,{"$f":"'Bilan des calculs'!C122","v":0},{"$f":"'Bilan des calculs'!D122","v":-75.822548140182846}]
[null,null,null,null,null,null,null,null,null,null,null,null,null,null,null,null,null,null,null,null,null,null,null,null,null,null,null,null,20,{"$f":"'Bilan des calculs'!C123","v":0},{"$f":"'Bilan des calculs'!D123","v":-75.822548140182846}]
[null,null,null,null,null,null,null,null,null,null,null,null,null,null,null,null,null,null,null,null,null,null,null,null,null,null,null,null,21,{"$f":"'Bilan des calculs'!C124","v":0},{"$f":"'Bilan des calculs'!D124","v":-75.822548140182846}]
[null,null,null,null,null,null,null,null,null,null,null,null,null,null,null,null,null,null,null,null,null,null,null,null,null,null,null,null,22,{"$f":"'Bilan des calculs'!C125","v":0},{"$f":"'Bilan des calculs'!D125","v":-75.822548140182846}]
[null,null,null,null,null,null,null,null,null,null,null,null,null,null,null,null,null,null,null,null,null,null,null,null,null,null,null,null,23,{"$f":"'Bilan des calculs'!C126","v":0},{"$f":"'Bilan des calculs'!D126","v":-75.822548140182846}]
[null,null,null,null,null,null,null,null,null,null,null,null,null,null,null,null,null,null,null,null,null,null,null,null,null,null,null,null,24,{"$f":"'Bilan des calculs'!C127","v":0},{"$f":"'Bilan des calculs'!D127","v":-75.822548140182846}]
[null,null,null,null,null,null,null,null,null,null,null,null,null,null,null,null,null,null,null,null,null,null,null,null,null,null,null,null,25,{"$f":"'Bilan des calculs'!C128","v":0},{"$f":"'Bilan des calculs'!D128","v":-75.822548140182846}]
[null,null,null,null,null,null,null,null,null,null,null,null,null,null,null,null,null,null,null,null,null,null,null,null,null,null,null,null,26,{"$f":"'Bilan des calculs'!C129","v":0},{"$f":"'Bilan des calculs'!D129","v":-75.822548140182846}]
[null,null,null,null,null,null,null,null,null,null,null,null,null,null,null,null,null,null,null,null,null,null,null,null,null,null,null,null,27,{"$f":"'Bilan des calculs'!C130","v":0},{"$f":"'Bilan des calculs'!D130","v":-75.822548140182846}]
[null,null,null,null,null,null,null,null,null,null,null,null,null,null,null,null,null,null,null,null,null,null,null,null,null,null,null,null,28,{"$f":"'Bilan des calculs'!C131","v":0},{"$f":"'Bilan des calculs'!D131","v":-75.822548140182846}]
[null,null,null,null,null,null,null,null,null,null,null,null,null,null,null,null,null,null,null,null,null,null,null,null,null,null,null,null,29,{"$f":"'Bilan des calculs'!C132","v":0},{"$f":"'Bilan des calculs'!D132","v":-75.822548140182846}]
[null,null,null,null,null,null,null,null,null,null,null,null,null,null,null,null,null,null,null,null,null,null,null,null,null,null,null,null,30,{"$f":"'Bilan des calculs'!C133","v":0},{"$f":"'Bilan des calculs'!D133","v":-75.822548140182846}]
[null,null,null,null,null,null,null,null,null,null,null,null,null,null,null,null,null,null,null,null,null,null,null,null,null,null,null,null,31,{"$f":"'Bilan des calculs'!C134","v":0},{"$f":"'Bilan des calculs'!D134","v":-75.822548140182846}]
[null,null,null,null,null,null,null,null,null,null,null,null,null,null,null,null,null,null,null,null,null,null,null,null,null,null,null,null,32,{"$f":"'Bilan des calculs'!C135","v":0},{"$f":"'Bilan des calculs'!D135","v":-75.822548140182846}]
[null,null,null,null,null,null,null,null,null,null,null,null,null,null,null,null,null,null,null,null,null,null,null,null,null,null,null,null,33,{"$f":"'Bilan des calculs'!C136","v":0},{"$f":"'Bilan des calculs'!D136","v":-75.822548140182846}]
[null,null,null,null,null,null,null,null,null,null,null,null,null,null,null,null,null,null,null,null,null,null,null,null,null,null,null,null,34,{"$f":"'Bilan des calculs'!C137","v":0},{"$f":"'Bilan des calculs'!D137","v":-75.822548140182846}]
[null,null,null,null,null,null,null,null,null,null,null,null,null,null,null,null,null,null,null,null,null,null,null,null,null,null,null,null,35,{"$f":"'Bilan des calculs'!C138","v":0},{"$f":"'Bilan des calculs'!D138","v":-75.822548140182846}]
[null,null,null,null,null,null,null,null,null,null,null,null,null,null,null,null,null,null,null,null,null,null,null,null,null,null,null,null,36,{"$f":"'Bilan des calculs'!C139","v":0},{"$f":"'Bilan des calculs'!D139","v":-75.822548140182846}]
[null,null,null,null,null,null,null,null,null,null,null,null,null,null,null,null,null,null,null,null,null,null,null,null,null,null,null,null,37,{"$f":"'Bilan des calculs'!C140","v":0},{"$f":"'Bilan des calculs'!D140","v":-75.822548140182846}]
[null,null,null,null,null,null,null,null,null,null,null,null,null,null,null,null,null,null,null,null,null,null,null,null,null,null,null,null,38,{"$f":"'Bilan des calculs'!C141","v":0},{"$f":"'Bilan des calculs'!D141","v":-75.822548140182846}]
[null,null,null,null,null,null,null,null,null,null,null,null,null,null,null,null,null,null,null,null,null,null,null,null,null,null,null,null,39,{"$f":"'Bilan des calculs'!C142","v":0},{"$f":"'Bilan des calculs'!D142","v":-75.822548140182846}]
[null,null,null,null,null,null,null,null,null,null,null,null,null,null,null,null,null,null,null,null,null,null,null,null,null,null,null,null,40,{"$f":"'Bilan des calculs'!C143","v":0},{"$f":"'Bilan des calculs'!D143","v":-75.822548140182846}]

{"sheet":"Bilan-Carbone","index":12,"n_rows":46,"n_cols":35,"rows_kept":46,"cut":false,"hidden":false,"merged":[[1,1,2,9],[17,1,18,2],[17,3,18,3],[17,4,18,5],[4,2,4,5],[23,5,23,9],[23,1,23,4],[6,2,6,5],[6,6,6,7],[6,8,7,8],[21,1,21,9],[6,9,7,9],[20,1,20,9]]}
[]
[null,{"$f":"IF(Langue!$A$200 = \"FR\",Dictionnaire!$A1469,Dictionnaire!$B1469)","v":"Carbone séquestré (tonnes de CO² équivalent) après 40 ans"},null,null,null,null,null,null,null,null,null,null,null,null,null,null,null,null,null,null,null,null,null,null,null,null,null,null,"Année","Marge actualisée de l'année en cours","Marge actualisée cumulative",null,null,"Pour choisir type de haie"]
[null,null,null,null,null,null,null,null,null,null,null,null,null,null,null,null,null,null,null,null,null,null,null,null,null,null,null,null,null,"($)","($)"]
[null,null,null,null,null,null,null,null,null,null,null,null,null,null,null,null,null,null,null,null,null,null,null,null,null,null,null,null,0,0,0]
[null,{"$f":"IF(Langue!$A$200 = \"FR\",Dictionnaire!$A1470,Dictionnaire!$B1470)","v":"Type de haie:"},{"$f":"AH9","v":"pour bande riveraine"},null,null,null,null,null,null,null,null,null,null,null,null,null,null,null,null,null,null,null,null,null,null,null,null,null,1,{"$f":"'Bilan des calculs'!C104","v":-16.981132075471702},{"$f":"'Bilan des calculs'!D104","v":-16.981132075471702},null,null,{"$f":"IF(AND(Langue!$A$200=\"FR\",'Menu simulation'!H6=TRUE),Dictionnaire!$A1493,IF(AND(Langue!$A$200=\"EN\",'Menu simulation'!H6=TRUE),(Dictionnaire!$B1493),\"\"))","v":""},{"$f":"IF(AH5=\"\",0,1)","v":0}]
[null,null,null,null,null,null,null,null,null,null,null,null,null,null,null,null,null,null,null,null,null,null,null,null,null,null,null,null,null,null,null,null,null,{"$f":"IF(AND(Langue!$A$200=\"FR\",'Menu simulation'!H8=TRUE),Dictionnaire!$A1494,IF(AND(Langue!$A$200=\"EN\",'Menu simulation'!H8=TRUE),(Dictionnaire!$B1494),\"\"))","v":""},{"$f":"IF(AH6=\"\",0,1)","v":0}]
[null,null,{"$f":"IF(Langue!$A$200 = \"FR\",Dictionnaire!$A1485,Dictionnaire!$B1485)","v":"Arbres"},null,null,null,{"$f":"IF(Langue!$A$200 = \"FR\",Dictionnaire!$A1491,Dictionnaire!$B1491)","v":"Arbustes**"},null,{"$f":"IF(Langue!$A$200 = \"FR\",Dictionnaire!$A1478,Dictionnaire!$B1478)","v":"Total Tonnes de CO2"},{"$f":"IF(Langue!$A$200 = \"FR\",Dictionnaire!$A1482,Dictionnaire!$B1482)","v":"Crédits carbone"},null,null,null,null,null,null,null,null,null,null,null,null,null,null,null,null,null,null,2,{"$f":"'Bilan des calculs'!C105","v":-16.019935920256319},{"$f":"'Bilan des calculs'!D105","v":-33.001067995728022},null,null,{"$f":"IF(AND(Langue!$A$200=\"FR\",'Menu simulation'!H10=TRUE),Dictionnaire!$A1495,IF(AND(Langue!$A$200=\"EN\",'Menu simulation'!H10=TRUE),(Dictionnaire!$B1495),\"\"))","v":"pour bande riveraine"},{"$f":"IF(AH7=\"\",0,1)","v":1}]
[null,null,{"$f":"IF(Langue!$A$200 = \"FR\",Dictionnaire!$A1486,Dictionnaire!$B1486)","v":"Résineux"},{"$f":"IF(Langue!$A$200 = \"FR\",Dictionnaire!$A1487,Dictionnaire!$B1487)","v":"Feuillus nobles"},{"$f":"IF(Langue!$A$200 = \"FR\",Dictionnaire!$A1488,Dictionnaire!$B1488)","v":"Peupliers hybrides*"},{"$f":"IF(Langue!$A$200 = \"FR\",Dictionnaire!$A1478,Dictionnaire!$B1478)","v":"Total Tonnes de CO2"},{"$f":"IF(Langue!$A$200 = \"FR\",Dictionnaire!$A1489,Dictionnaire!$B1489)","v":"Arbustes"},{"$f":"IF(Langue!$A$200 = \"FR\",Dictionnaire!$A1490,Dictionnaire!$B1490)","v":"Saules hybrides"},null,null,null,null,null,null,null,null,null,null,null,null,null,null,null,null,null,null,null,null,null,null,null,null,null,{"$f":"IF(AND(Langue!$A$200=\"FR\",'Menu simulation'!H12=TRUE),Dictionnaire!$A1496,IF(AND(Langue!$A$200=\"EN\",'Menu simulation'!H12=TRUE),(Dictionnaire!$B1496),\"\"))","v":""},{"$f":"IF(AH8=\"\",0,1)","v":0}]
[null,{"$f":"IF(Langue!$A$200 = \"FR\",Dictionnaire!$A1471,Dictionnaire!$B1471)","v":"Rangée 1"},{"$f":"'Crédits carbone'!$I$53/1000","v":0},{"$f":"'Crédits carbone'!$I$56/1000","v":0},{"$f":"('Crédits carbone'!$I$54+'Crédits carbone'!$I$55)/1000","v":0},{"$f":"C9+D9+E9","v":0},{"$f":"'Crédits carbone'!$I$50/1000","v":0},{"$f":"'Crédits carbone'!$I$58/1000","v":0},{"$f":"H9+G9+F9","v":0},{"$f":"I9*$D$18","v":0},null,null,null,null,null,null,null,null,null,null,null,null,null,null,null,null,null,null,3,{"$f":"'Bilan des calculs'!C106","v":-15.113147094581432},{"$f":"'Bilan des calculs'!D106","v":-48.114215090309457},null,null,{"$f":"IF(AI5=1,AH5,IF(AI6=1,AH6,IF(AI7=1,AH7,IF(AI8=1,AH8,\"\"))))","v":"pour bande riveraine"}]
[null,{"$f":"IF(Langue!$A$200 = \"FR\",Dictionnaire!$A1472,Dictionnaire!$B1472)","v":"Rangée 2"},{"$f":"'Crédits carbone'!$J$53/1000","v":0},{"$f":"'Crédits carbone'!$J$56/1000","v":0},{"$f":"('Crédits carbone'!$J$54+'Crédits carbone'!$J$55)/1000","v":0},{"$f":"C10+D10+E10","v":0},{"$f":"'Crédits carbone'!$J$50/1000","v":0},{"$f":"'Crédits carbone'!$J$58/1000","v":0},{"$f":"H10+G10+F10","v":0},0,null,null,null,null,null,null,null,null,null,null,null,null,null,null,null,null,null,null,4,{"$f":"'Bilan des calculs'!C107","v":-14.25768593828437},{"$f":"'Bilan des calculs'!D107","v":-62.371901028593825}]
[null,{"$f":"IF(Langue!$A$200 = \"FR\",Dictionnaire!$A1473,Dictionnaire!$B1473)","v":"Rangée 3"},{"$f":"'Crédits carbone'!$K$53/1000","v":0},{"$f":"'Crédits carbone'!$K$56/1000","v":0},{"$f":"('Crédits carbone'!$K$54+'Crédits carbone'!$K$55)/1000","v":0},0,{"$f":"'Crédits carbone'!$K$50/1000","v":0},{"$f":"'Crédits carbone'!$K$58/1000","v":0},0,0,null,null,null,null,null,null,null,null,null,null,null,null,null,null,null,null,null,null,5,{"$f":"'Bilan des calculs'!C108","v":-13.450647111589026},{"$f":"'Bilan des calculs'!D108","v":-75.822548140182846}]
[null,{"$f":"IF(Langue!$A$200 = \"FR\",Dictionnaire!$A1474,Dictionnaire!$B1474)","v":"Rangée 4"},{"$f":"'Crédits carbone'!$L$53/1000","v":0},{"$f":"'Crédits carbone'!$L$56/1000","v":0},{"$f":"('Crédits carbone'!$L$54+'Crédits carbone'!$L$55)/1000","v":0},0,{"$f":"'Crédits carbone'!$L$50/1000","v":0},{"$f":"'Crédits carbone'!$L$58/1000","v":0},0,0,null,null,null,null,null,null,null,null,null,null,null,null,null,null,null,null,null,null,6,{"$f":"'Bilan des calculs'!C109","v":0},{"$f":"'Bilan des calculs'!D109","v":-75.822548140182846}]
[null,{"$f":"IF(Langue!$A$200 = \"FR\",Dictionnaire!$A1475,Dictionnaire!$B1475)","v":"Rangée 5"},{"$f":"'Crédits carbone'!$M$53/1000","v":0},{"$f":"'Crédits carbone'!$M$56/1000","v":0},{"$f":"('Crédits carbone'!$M$54+'Crédits carbone'!$M$55)/1000","v":0},0,{"$f":"'Crédits carbone'!$M$50/1000","v":0},{"$f":"'Crédits carbone'!$M$58/1000","v":0},0,0,null,null,null,null,null,null,null,null,null,null,null,null,null,null,null,null,null,null,7,{"$f":"'Bilan des calculs'!C110","v":0},{"$f":"'Bilan des calculs'!D110","v":-75.822548140182846}]
[null,{"$f":"IF(Langue!$A$200 = \"FR\",Dictionnaire!$A1476,Dictionnaire!$B1476)","v":"Rangée 6"},{"$f":"'Crédits carbone'!$N$53/1000","v":0},{"$f":"'Crédits carbone'!$N$56/1000","v":0},{"$f":"('Crédits carbone'!$N$54+'Crédits carbone'!$N$55)/1000","v":0},0,{"$f":"'Crédits carbone'!$N$50/1000","v":0},{"$f":"'Crédits carbone'!$N$58/1000","v":0},0,0,null,null,null,null,null,null,null,null,null,null,null,null,null,null,null,null,null,null,8,{"$f":"'Bilan des calculs'!C111","v":0},{"$f":"'Bilan des calculs'!D111","v":-75.822548140182846}]
[null,{"$f":"IF(Langue!$A$200 = \"FR\",Dictionnaire!$A1477,Dictionnaire!$B1477)","v":"Rangée 7"},{"$f":"'Crédits carbone'!$O$53/1000","v":0},{"$f":"'Crédits carbone'!$O$56/1000","v":0},{"$f":"('Crédits carbone'!$O$54+'Crédits carbone'!$O$55)/1000","v":0},0,{"$f":"'Crédits carbone'!$O$50/1000","v":0},{"$f":"'Crédits carbone'!$O$58/1000","v":0},0,0,null,null,null,null,null,null,null,null,null,null,null,null,null,null,null,null,null,null,9,{"$f":"'Bilan des calculs'!C112","v":0},{"$f":"'Bilan des calculs'!D112","v":-75.822548140182846}]
[null,{"$f":"IF(Langue!$A$200 = \"FR\",Dictionnaire!$A1478,Dictionnaire!$B1478)","v":"Total Tonnes de CO2"},{"$f":"'Crédits carbone'!$P$53/1000","v":0},{"$f":"'Crédits carbone'!$P$56/1000","v":0},{"$f":"('Crédits carbone'!$P$54+'Crédits carbone'!$P$55)/1000","v":0},0,{"$f":"'Crédits carbone'!$P$50/1000","v":0},{"$f":"'Crédits carbone'!$P$58/1000","v":0},0,0,null,null,null,null,null,null,null,null,null,null,null,null,null,null,null,null,null,null,10,{"$f":"'Bilan des calculs'!C113","v":0},{"$f":"'Bilan des calculs'!D113","v":-75.822548140182846}]
[null,null,null,null,null,null,null,null,null,null,null,null,null,null,null,null,null,null,null,null,null,null,null,null,null,null,null,null,11,{"$f":"'Bilan des calculs'!C114","v":0},{"$f":"'Bilan des calculs'!D114","v":-75.822548140182846}]
[null,{"$f":"IF(Langue!$A$200 = \"FR\",Dictionnaire!$A1483,Dictionnaire!$B1483)","v":"Prix de la réduction d’une tonne des GES :"},null,{"$f":"Questionnaire!G155","v":0},{"$f":"IF(Langue!$A$200 = \"FR\",Dictionnaire!$A1484,Dictionnaire!$B1484)","v":"/tonne CO2"},null,null,null,null,null,null,null,null,null,null,null,null,null,null,null,null,null,null,null,null,null,null,null,12,{"$f":"'Bilan des calculs'!C115","v":0},{"$f":"'Bilan des calculs'!D115","v":-75.822548140182846}]
[null,null,null,null,null,null,null,null,null,null,null,null,null,null,null,null,null,null,null,null,null,null,null,null,null,null,null,null,13,{"$f":"'Bilan des calculs'!C116","v":0},{"$f":"'Bilan des calculs'!D116","v":-75.822548140182846}]
[]
[null,{"$f":"IF(Langue!$A$200 = \"FR\",Dictionnaire!$A1480,Dictionnaire!$B1480)","v":"*Pour le PEH, la valeur de CO2-C indiquer comprend la valeur à 20 ans si il y a eu récolte ou à 40 ans si pas de récolte à 20 ans"},null,null,null,null,null,null,null,null,null,null,null,null,null,null,null,null,null,null,null,null,null,null,null,null,null,null,14,{"$f":"'Bilan des calculs'!C117","v":0},{"$f":"'Bilan des calculs'!D117","v":-75.822548140182846}]
[null,{"$f":"IF(Langue!$A$200 = \"FR\",Dictionnaire!$A1481,Dictionnaire!$B1481)","v":"**Pour les arbustes, la valeur de CO2-C indiquer comprend la valeur à 10 ans"},null,null,null,null,null,null,null,null,null,null,null,null,null,null,null,null,null,null,null,null,null,null,null,null,null,null,15,{"$f":"'Bilan des calculs'!C118","v":0},{"$f":"'Bilan des calculs'!D118","v":-75.822548140182846}]
[null,null,null,null,null,null,null,null,null,null,null,null,null,null,null,null,null,null,null,null,null,null,null,null,null,null,null,null,17,{"$f":"'Bilan des calculs'!C120","v":0},{"$f":"'Bilan des calculs'!D120","v":-75.822548140182846}]
[null,{"$f":"IF(Langue!$A$200 = \"FR\",Dictionnaire!A733,Dictionnaire!B733)","v":"Résultats"},null,null,null,"Menus",null,null,null,null,null,null,null,null,null,null,null,null,null,null,null,null,null,null,null,null,null,null,18,{"$f":"'Bilan des calculs'!C121","v":0},{"$f":"'Bilan des calculs'!D121","v":-75.822548140182846}]
[null,null,null,null,null,null,null,null,null,null,null,null,null,null,null,null,null,null,null,null,null,null,null,null,null,null,null,null,19,{"$f":"'Bilan des calculs'!C122","v":0},{"$f":"'Bilan des calculs'!D122","v":-75.822548140182846}]
[null,null,null,null,null,null,null,null,null,null,null,null,null,null,null,null,null,null,null,null,null,null,null,null,null,null,null,null,20,{"$f":"'Bilan des calculs'!C123","v":0},{"$f":"'Bilan des calculs'!D123","v":-75.822548140182846}]
[null,null,null,null,null,null,null,null,null,null,null,null,null,null,null,null,null,null,null,null,null,null,null,null,null,null,null,null,21,{"$f":"'Bilan des calculs'!C124","v":0},{"$f":"'Bilan des calculs'!D124","v":-75.822548140182846}]
[null,null,null,null,null,null,null,null,null,null,null,null,null,null,null,null,null,null,null,null,null,null,null,null,null,null,null,null,22,{"$f":"'Bilan des calculs'!C125","v":0},{"$f":"'Bilan des calculs'!D125","v":-75.822548140182846}]
[null,null,null,null,null,null,null,null,null,null,null,null,null,null,null,null,null,null,null,null,null,null,null,null,null,null,null,null,23,{"$f":"'Bilan des calculs'!C126","v":0},{"$f":"'Bilan des calculs'!D126","v":-75.822548140182846}]
[null,null,null,null,null,null,null,null,null,null,null,null,null,null,null,null,null,null,null,null,null,null,null,null,null,null,null,null,24,{"$f":"'Bilan des calculs'!C127","v":0},{"$f":"'Bilan des calculs'!D127","v":-75.822548140182846}]
[null,null,null,null,null,null,null,null,null,null,null,null,null,null,null,null,null,null,null,null,null,null,null,null,null,null,null,null,25,{"$f":"'Bilan des calculs'!C128","v":0},{"$f":"'Bilan des calculs'!D128","v":-75.822548140182846}]
[null,null,null,null,null,null,null,null,null,null,null,null,null,null,null,null,null,null,null,null,null,null,null,null,null,null,null,null,26,{"$f":"'Bilan des calculs'!C129","v":0},{"$f":"'Bilan des calculs'!D129","v":-75.822548140182846}]
[null,null,null,null,null,null,null,null,null,null,null,null,null,null,null,null,null,null,null,null,null,null,null,null,null,null,null,null,27,{"$f":"'Bilan des calculs'!C130","v":0},{"$f":"'Bilan des calculs'!D130","v":-75.822548140182846}]
[null,null,null,null,null,null,null,null,null,null,null,null,null,null,null,null,null,null,null,null,null,null,null,null,null,null,null,null,28,{"$f":"'Bilan des calculs'!C131","v":0},{"$f":"'Bilan des calculs'!D131","v":-75.822548140182846}]
[null,null,null,null,null,null,null,null,null,null,null,null,null,null,null,null,null,null,null,null,null,null,null,null,null,null,null,null,29,{"$f":"'Bilan des calculs'!C132","v":0},{"$f":"'Bilan des calculs'!D132","v":-75.822548140182846}]
[null,null,null,null,null,null,null,null,null,null,null,null,null,null,null,null,null,null,null,null,null,null,null,null,null,null,null,null,30,{"$f":"'Bilan des calculs'!C133","v":0},{"$f":"'Bilan des calculs'!D133","v":-75.822548140182846}]
[null,null,null,null,null,null,null,null,null,null,null,null,null,null,null,null,null,null,null,null,null,null,null,null,null,null,null,null,31,{"$f":"'Bilan des calculs'!C134","v":0},{"$f":"'Bilan des calculs'!D134","v":-75.822548140182846}]
[null,null,null,null,null,null,null,null,null,null,null,null,null,null,null,null,null,null,null,null,null,null,null,null,null,null,null,null,32,{"$f":"'Bilan des calculs'!C135","v":0},{"$f":"'Bilan des calculs'!D135","v":-75.822548140182846}]
[null,null,null,null,null,null,null,null,null,null,null,null,null,null,null,null,null,null,null,null,null,null,null,null,null,null,null,null,33,{"$f":"'Bilan des calculs'!C136","v":0},{"$f":"'Bilan des calculs'!D136","v":-75.822548140182846}]
[null,null,null,null,null,null,null,null,null,null,null,null,null,null,null,null,null,null,null,null,null,null,null,null,null,null,null,null,34,{"$f":"'Bilan des calculs'!C137","v":0},{"$f":"'Bilan des calculs'!D137","v":-75.822548140182846}]
[null,null,null,null,null,null,null,null,null,null,null,null,null,null,null,null,null,null,null,null,null,null,null,null,null,null,null,null,35,{"$f":"'Bilan des calculs'!C138","v":0},{"$f":"'Bilan des calculs'!D138","v":-75.822548140182846}]
[null,null,null,null,null,null,null,null,null,null,null,null,null,null,null,null,null,null,null,null,null,null,null,null,null,null,null,null,36,{"$f":"'Bilan des calculs'!C139","v":0},{"$f":"'Bilan des calculs'!D139","v":-75.822548140182846}]
[null,null,null,null,null,null,null,null,null,null,null,null,null,null,null,null,null,null,null,null,null,null,null,null,null,null,null,null,37,{"$f":"'Bilan des calculs'!C140","v":0},{"$f":"'Bilan des calculs'!D140","v":-75.822548140182846}]
[null,null,null,null,null,null,null,null,null,null,null,null,null,null,null,null,null,null,null,null,null,null,null,null,null,null,null,null,38,{"$f":"'Bilan des calculs'!C141","v":0},{"$f":"'Bilan des calculs'!D141","v":-75.822548140182846}]
[null,null,null,null,null,null,null,null,null,null,null,null,null,null,null,null,null,null,null,null,null,null,null,null,null,null,null,null,39,{"$f":"'Bilan des calculs'!C142","v":0},{"$f":"'Bilan des calculs'!D142","v":-75.822548140182846}]
[null,null,null,null,null,null,null,null,null,null,null,null,null,null,null,null,null,null,null,null,null,null,null,null,null,null,null,null,40,{"$f":"'Bilan des calculs'!C143","v":0},{"$f":"'Bilan des calculs'!D143","v":-75.822548140182846}]

{"sheet":"Compilation","index":13,"n_rows":230,"n_cols":2,"rows_kept":230,"cut":false,"hidden":false,"merged":[[0,40,0,47],[0,80,0,87],[0,48,0,55],[0,72,0,79],[0,0,0,1],[0,16,0,23],[0,24,0,31],[0,32,0,39],[0,56,0,63],[0,64,0,71],[0,232,0,239],[0,200,0,207],[0,208,0,215],[0,216,0,223],[0,224,0,231],[0,184,0,191],[0,192,0,199],[0,144,0,151],[0,128,0,135],[0,168,0,175],[0,176,0,183],[0,88,0,95],[0,120,0,127],[0,104,0,111],[0,96,0,103],[0,160,0,167],[0,136,0,143],[0,152,0,159],[0,112,0,119]]}
[]
[]
[null,"Simulation en cours"]
[{"$f":"IF(Langue!$A$200 = \"FR\",Dictionnaire!A485,Dictionnaire!B485)","v":"Description du scénario"}]
["Date"]
[]
[{"$f":"Paramètres!B2","v":"Paramètres"}]
[{"$f":"Paramètres!B14","v":"Taux d'actualisation annuel ? (valeur calculée, ne pas modifier)"},{"$f":"Paramètres!I14","v":{"$error":"#REF!"}}]
[{"$f":"Paramètres!B16","v":"Taux d'intérêt perçu sur les placements ?"},{"$f":"Paramètres!I16","v":0}]
[{"$f":"Paramètres!B18","v":"Taux d'intérêt payé sur les emprunts ?"},{"$f":"Paramètres!I18","v":0}]
[{"$f":"Paramètres!B20","v":"Taux d'inflation annuel ? (utiliser les flèches pour modifier le pourcentage)"},{"$f":"Paramètres!I20","v":0.02}]
[{"$f":"Paramètres!B24","v":"Rouleau de pailllis de plastique de 1,2 ou 1,5 m de large"},{"$f":"Paramètres!I24","v":225}]
[{"$f":"Paramètres!B25","v":"Petite collerette (30 cm X 30 cm)"},{"$f":"Paramètres!I25","v":0.63}]
[{"$f":"Paramètres!B28","v":"Broches servant à fixer les collerettes"},{"$f":"Paramètres!I28","v":0.23}]
[{"$f":"Paramètres!B29","v":"Taux horaire pour la main d'œuvre lors de l'établissement et l'entretien de la haie ($/h)"},{"$f":"Paramètres!I29","v":35}]
[{"$f":"Paramètres!B30","v":"Frais de déplacement ($/km)"},{"$f":"Paramètres!I30","v":0.5}]
[{"$f":"Paramètres!B31","v":"Taux horaire pour les travaux mécaniques de préparation du sol ($/h)"},{"$f":"Paramètres!I31","v":150}]
[{"$f":"Paramètres!B32","v":"Plans et devis (montant forfaitaire)"},{"$f":"Paramètres!I32","v":800}]
[{"$f":"Paramètres!B36","v":"Taux de mortalité anticipé la première année suivant la plantation"},{"$f":"Paramètres!I36","v":0.05}]
[{"$f":"Paramètres!B37","v":"Taux horaire (machinerie et main d'œuvre) pour le fauchage et l'inspection phytosanitaire ($/h)"},{"$f":"Paramètres!I37","v":45}]
[{"$f":"Paramètres!B39","v":"Nombre de fauchages par année"},{"$f":"Paramètres!I39","v":2}]
[{"$f":"Paramètres!B40","v":"Frais de déplacement avec la machinerie ($/km)"},{"$f":"Paramètres!I40","v":0.7}]
[{"$f":"Paramètres!B41","v":"Spirale de protection contre les rongeurs"},{"$f":"Paramètres!I41","v":1.25}]
[{"$f":"Paramètres!B42","v":"Gaine de protection contre les chevreuils (Climanet)"},{"$f":"Paramètres!I42","v":7.5}]
[{"$f":"Paramètres!B46","v":"Marges sur coûts variables/ha, utilisés pour les calculs liés à la perte d'espace cultivable"}]
[{"$f":"Paramètres!F48","v":"Foin"},{"$f":"Paramètres!H48","v":521}]
[{"$f":"Paramètres!F49","v":"Avoine"},{"$f":"Paramètres!H49","v":468}]
[{"$f":"Paramètres!F50","v":"Avoine biologique"},{"$f":"Paramètres!H50","v":222}]
[{"$f":"Paramètres!F51","v":"Blé d'alimentation animale"},{"$f":"Paramètres!H51","v":540}]
[{"$f":"Paramètres!F52","v":"Blé d'alimentation humaine"},{"$f":"Paramètres!H52","v":629}]
[{"$f":"Paramètres!F53","v":"Blé panifiable biologique"},{"$f":"Paramètres!H53","v":744}]
[{"$f":"Paramètres!F54","v":"Orge d'alimentation animale"},{"$f":"Paramètres!H54","v":458}]
[{"$f":"Paramètres!F55","v":"Orge biologique"},{"$f":"Paramètres!H55","v":557}]
[{"$f":"Paramètres!B78","v":"Prix de vente incluant le transport"}]
[{"$f":"CONCATENATE(Paramètres!F78,\" (\",Paramètres!F81,\")\")","v":"Valeur si le bois est vendu pour le sciage  ( $/m3 solide)"}]
[{"$f":"Paramètres!D82","v":"Épinettes, Pins ou Thuyas"},{"$f":"Paramètres!F82","v":52}]
[{"$f":"Paramètres!D83","v":"Peupliers hybrides"},{"$f":"Paramètres!F83","v":41}]
[{"$f":"Paramètres!D84","v":"Feuillus nobles"},{"$f":"Paramètres!F84","v":61}]
[{"$f":"CONCATENATE(Paramètres!G78,\" (\",Paramètres!G81,\")\")","v":"Valeur si le bois est vendu pour le déroulage  ( $/m3 solide)"}]
[{"$f":"Paramètres!D83","v":"Peupliers hybrides"},{"$f":"Paramètres!G83","v":65}]
[{"$f":"Paramètres!D84","v":"Feuillus nobles"},{"$f":"Paramètres!G84","v":145}]
[{"$f":"CONCATENATE(Paramètres!H78,\" (\",Paramètres!H81,\")\")","v":"Valeur si le bois est vendu pour du bois de chauffage  ($/Corde de 8' (non débité))"}]
[{"$f":"Paramètres!D84","v":"Feuillus nobles"},{"$f":"Paramètres!H84","v":225}]
[{"$f":"CONCATENATE(Paramètres!I78,\" (\",Paramètres!I81,\")\")","v":"Valeur de la biomasse brut (pâte ou autres destinations)  ($/TMV)"}]
[{"$f":"Paramètres!D82","v":"Épinettes, Pins ou Thuyas"},{"$f":"Paramètres!I82","v":30}]
[{"$f":"Paramètres!D83","v":"Peupliers hybrides"},{"$f":"Paramètres!I83","v":32}]
[{"$f":"Paramètres!D84","v":"Feuillus nobles"},{"$f":"Paramètres!I84","v":40}]
[{"$f":"Paramètres!D85","v":"Saules hybrides (tonne M.S.)"},{"$f":"Paramètres!I85","v":32}]
[{"$f":"Paramètres!B100","v":"Quelle est la hauteur maximale d'une haie de peupliers hybrides à maturité?"},{"$f":"Paramètres!I100","v":25}]
[{"$f":"Paramètres!B103","v":"Quelle est la hauteur maximale d'une haie d'arbustes à maturité?"},{"$f":"Paramètres!I103","v":3}]
[{"$f":"Paramètres!B105","v":"Augmentations de la marge (produits sur débours/ha) utilisées pour les calculs liées à la protection de culture (résultat obtenu en multipliant le rendement par le prix à la tonne par une augmentation de rendement de 1%)."}]
[{"$f":"Paramètres!F107","v":"Foin"},{"$f":"Paramètres!H107","v":12.38}]
[{"$f":"Paramètres!F108","v":"Avoine"},{"$f":"Paramètres!H108","v":7.93}]
[{"$f":"Paramètres!F109","v":"Avoine biologique"},{"$f":"Paramètres!H110","v":11.77}]
[{"$f":"Paramètres!F110","v":"Blé d'alimentation animale"},{"$f":"Paramètres!H113","v":11.27}]
[{"$f":"Paramètres!F111","v":"Blé d'alimentation humaine"},{"$f":"Paramètres!H115","v":33.14}]
[{"$f":"Paramètres!F112","v":"Blé panifiable biologique"},{"$f":"Paramètres!H116","v":37.5}]
[{"$f":"Paramètres!F113","v":"Orge d'alimentation animale"},{"$f":"Paramètres!H118","v":19.11}]
[{"$f":"Paramètres!F114","v":"Orge biologique"},{"$f":"Paramètres!H120","v":17.23}]
[]
[{"$f":"Questionnaire!B2","v":"Questionnaire"}]
[{"$f":"IF(Langue!$A$200 = \"FR\",Dictionnaire!A543,Dictionnaire!B543)","v":"1re étape : choisissez à quelle fin vous désirez faire l'implantation d'une haie brise-vent"},{"$f":" IF(Langue!A200=\"FR\",IF('Menu simulation'!H6=TRUE,\"Protection de culture\",IF('Menu simulation'!H8=TRUE,\"Protection de bâtiment\",IF('Menu simulation'!H10=TRUE,\"Bande riveraine\"))),IF('Menu simulation'!H6=TRUE,\"Crop protection\",IF('Menu simulation'!H8=TRUE,\"Building protection\",IF('Menu simulation'!H10=TRUE,\"Buffer strip\"))))","v":"Bande riveraine"}]
[{"$f":"Questionnaire!B12","v":"Section 1 : Établissement de la haie"}]
[{"$f":"Questionnaire!B14","v":"Taux d'actualisation annuel ?"},{"$f":"Questionnaire!E14","v":0.06}]
[{"$f":"Questionnaire!B16","v":"Longueur de la haie (m) ?"},{"$f":"Questionnaire!E16","v":0}]
[{"$f":"Questionnaire!B18","v":"Nombre de rangées ? (maximum 7)"},{"$f":"Questionnaire!E18","v":0}]
[{"$f":"Questionnaire!B20","v":"Espacement entre les rangées (m) ?"},{"$f":"Questionnaire!E20","v":0}]
[{"$f":"Questionnaire!B22","v":"Quelle est la séquence d'établissement des arbres et/ou arbustes ?"}]
[{"$f":"Questionnaire!C24","v":"Espèce no.1"}]
[{"$f":"Questionnaire!B$25","v":"Rangée 1"},{"$f":"Questionnaire!C25","v":0}]
[{"$f":"Questionnaire!B$26","v":"Rangée 2"},{"$f":"Questionnaire!C26","v":0}]
[{"$f":"Questionnaire!B$27","v":"Rangée 3"},{"$f":"Questionnaire!C27","v":0}]
[{"$f":"Questionnaire!B$28","v":"Rangée 4"},{"$f":"Questionnaire!C28","v":0}]
[{"$f":"Questionnaire!B$29","v":"Rangée 5"},{"$f":"Questionnaire!C29","v":0}]
[{"$f":"Questionnaire!B$30","v":"Rangée 6"},{"$f":"Questionnaire!C30","v":0}]
[{"$f":"Questionnaire!B$31","v":"Rangée 7"},{"$f":"Questionnaire!C31","v":0}]
[{"$f":"Questionnaire!D24","v":"Espèce no.2"}]
[{"$f":"Questionnaire!B$25","v":"Rangée 1"},{"$f":"Questionnaire!D25","v":0}]
[{"$f":"Questionnaire!B$26","v":"Rangée 2"},{"$f":"Questionnaire!D26","v":0}]
[{"$f":"Questionnaire!B$27","v":"Rangée 3"},{"$f":"Questionnaire!D27","v":0}]
[{"$f":"Questionnaire!B$28","v":"Rangée 4"},{"$f":"Questionnaire!D28","v":0}]
[{"$f":"Questionnaire!B$29","v":"Rangée 5"},{"$f":"Questionnaire!D29","v":0}]
[{"$f":"Questionnaire!B$30","v":"Rangée 6"},{"$f":"Questionnaire!D30","v":0}]
[{"$f":"Questionnaire!B$31","v":"Rangée 7"},{"$f":"Questionnaire!D31","v":0}]
[{"$f":"Questionnaire!E24","v":"Espèce no.3"}]
[{"$f":"Questionnaire!B$25","v":"Rangée 1"},{"$f":"Questionnaire!E25","v":0}]
[{"$f":"Questionnaire!B$26","v":"Rangée 2"},{"$f":"Questionnaire!E26","v":0}]
[{"$f":"Questionnaire!B$27","v":"Rangée 3"},{"$f":"Questionnaire!E27","v":0}]
[{"$f":"Questionnaire!B$28","v":"Rangée 4"},{"$f":"Questionnaire!E28","v":0}]
[{"$f":"Questionnaire!B$29","v":"Rangée 5"},{"$f":"Questionnaire!E29","v":0}]
[{"$f":"Questionnaire!B$30","v":"Rangée 6"},{"$f":"Questionnaire!E30","v":0}]
[{"$f":"Questionnaire!B$31","v":"Rangée 7"},{"$f":"Questionnaire!E31","v":0}]
[{"$f":"Questionnaire!F24","v":"Espèce no.4"}]
[{"$f":"Questionnaire!B$25","v":"Rangée 1"},{"$f":"Questionnaire!F25","v":0}]
[{"$f":"Questionnaire!B$26","v":"Rangée 2"},{"$f":"Questionnaire!F26","v":0}]
[{"$f":"Questionnaire!B$27","v":"Rangée 3"},{"$f":"Questionnaire!F27","v":0}]
[{"$f":"Questionnaire!B$28","v":"Rangée 4"},{"$f":"Questionnaire!F28","v":0}]
[{"$f":"Questionnaire!B$29","v":"Rangée 5"},{"$f":"Questionnaire!F29","v":0}]
[{"$f":"Questionnaire!B$30","v":"Rangée 6"},{"$f":"Questionnaire!F30","v":0}]
[{"$f":"Questionnaire!B$31","v":"Rangée 7"},{"$f":"Questionnaire!F31","v":0}]
[{"$f":"Questionnaire!G24","v":"Espèce no.5"}]
[{"$f":"Questionnaire!B$25","v":"Rangée 1"},{"$f":"Questionnaire!G25","v":0}]
[{"$f":"Questionnaire!B$26","v":"Rangée 2"},{"$f":"Questionnaire!G26","v":0}]
[{"$f":"Questionnaire!B$27","v":"Rangée 3"},{"$f":"Questionnaire!G27","v":0}]
[{"$f":"Questionnaire!B$28","v":"Rangée 4"},{"$f":"Questionnaire!G28","v":0}]
[{"$f":"Questionnaire!B$29","v":"Rangée 5"},{"$f":"Questionnaire!G29","v":0}]
[{"$f":"Questionnaire!B$30","v":"Rangée 6"},{"$f":"Questionnaire!G30","v":0}]
[{"$f":"Questionnaire!B$31","v":"Rangée 7"},{"$f":"Questionnaire!G31","v":0}]
[{"$f":"Questionnaire!H24","v":"Espèce no.6"}]
[{"$f":"Questionnaire!B$25","v":"Rangée 1"},{"$f":"Questionnaire!H25","v":0}]
[{"$f":"Questionnaire!B$26","v":"Rangée 2"},{"$f":"Questionnaire!H26","v":0}]
[{"$f":"Questionnaire!B$27","v":"Rangée 3"},{"$f":"Questionnaire!H27","v":0}]
[{"$f":"Questionnaire!B$28","v":"Rangée 4"},{"$f":"Questionnaire!H28","v":0}]
[{"$f":"Questionnaire!B$29","v":"Rangée 5"},{"$f":"Questionnaire!H29","v":0}]
[{"$f":"Questionnaire!B$30","v":"Rangée 6"},{"$f":"Questionnaire!H30","v":0}]
[{"$f":"Questionnaire!B$31","v":"Rangée 7"},{"$f":"Questionnaire!H31","v":0}]
[{"$f":"Questionnaire!I24","v":"Espèce no.7"}]
[{"$f":"Questionnaire!B$25","v":"Rangée 1"},{"$f":"Questionnaire!I25","v":0}]
[{"$f":"Questionnaire!B$26","v":"Rangée 2"},{"$f":"Questionnaire!I26","v":0}]
[{"$f":"Questionnaire!B$27","v":"Rangée 3"},{"$f":"Questionnaire!I27","v":0}]
[{"$f":"Questionnaire!B$28","v":"Rangée 4"},{"$f":"Questionnaire!I28","v":0}]
[{"$f":"Questionnaire!B$29","v":"Rangée 5"},{"$f":"Questionnaire!I29","v":0}]
[{"$f":"Questionnaire!B$30","v":"Rangée 6"},{"$f":"Questionnaire!I30","v":0}]
[{"$f":"Questionnaire!B$31","v":"Rangée 7"},{"$f":"Questionnaire!I31","v":0}]
[{"$f":"Questionnaire!B33","v":"Quel est l'espacement entre les végétaux (m) ?"}]
[{"$f":"Questionnaire!B35","v":"Rangée 1"},{"$f":"Questionnaire!C35","v":"0"}]
[{"$f":"Questionnaire!B36","v":"Rangée 2"},{"$f":"Questionnaire!C36","v":"0"}]
[{"$f":"Questionnaire!B37","v":"Rangée 3"},{"$f":"Questionnaire!C37","v":"0"}]
[{"$f":"Questionnaire!B38","v":"Rangée 4"},{"$f":"Questionnaire!C38","v":"0"}]
[{"$f":"Questionnaire!B39","v":"Rangée 5"},{"$f":"Questionnaire!C39","v":"0"}]
[{"$f":"Questionnaire!B40","v":"Rangée 6"},{"$f":"Questionnaire!C40","v":"0"}]
[{"$f":"Questionnaire!B41","v":"Rangée 7"},{"$f":"Questionnaire!C41","v":"0"}]
[{"$f":"Questionnaire!B43","v":"Type de paillis utilisé ?"},{"$f":"Questionnaire!G43","v":"4"}]
[{"$f":"Questionnaire!B46","v":"Quels sont les coûts des végétaux ($) ?"}]
[{"$f":"Questionnaire!D48","v":"Épinettes, Pins ou Thuyas (CON)"},{"$f":"Questionnaire!E48","v":9}]
[{"$f":"Questionnaire!D49","v":"Peupliers hybrides (PEH)"},{"$f":"Questionnaire!E49","v":9}]
[{"$f":"Questionnaire!D50","v":"Feuillus nobles (FNO)"},{"$f":"Questionnaire!E50","v":9}]
[{"$f":"Questionnaire!D51","v":"Arbustes (ARB)"},{"$f":"Questionnaire!E51","v":9}]
[{"$f":"Questionnaire!D52","v":"Saules hybrides (SAH)"},{"$f":"Questionnaire!E52","v":0.5}]
[{"$f":"Questionnaire!B56","v":"Inscrire la distance entre le site d'établissement et le point de départ des ouvriers"},{"$f":"Questionnaire!H56","v":0}]
[{"$f":"Questionnaire!B58","v":"Subvention (programme Prime-Vert par défaut)"},{"$f":"Questionnaire!H58","v":0.7}]
[{"$f":"Questionnaire!B60","v":"Désirez-vous effectuer votre établissement avec des arbres de fort calibre ?"},{"$f":"Questionnaire!H60","v":"Non"}]
[]
[{"$f":"Questionnaire!B66","v":"Section 2 : Entretien de la haie"}]
[{"$f":"Questionnaire!B68","v":"Désirez-vous effectuer les activités d'entretien suivantes ?"}]
[{"$f":"Questionnaire!C70","v":"Remplacement des arbres morts la deuxième année"},{"$f":"Questionnaire!G70","v":"Oui"}]
[{"$f":"Questionnaire!C72","v":"Fauchage et inspection phytosanitaire (1 fois par an, 1 à 5 ans)"},{"$f":"Questionnaire!G72","v":"Oui"}]
[{"$f":"Questionnaire!C74","v":"Taille de formation et élagage"},{"$f":"Questionnaire!G74","v":"Oui"}]
[{"$f":"Questionnaire!C76","v":"Recépage des arbustes"},{"$f":"Questionnaire!G76","v":"Oui"}]
[{"$f":"Questionnaire!B62","v":"Protection contre les ravageurs"},{"$f":"Questionnaire!H62","v":"Non"}]
[{"$f":"Questionnaire!B64","v":"Si oui, spécifiez lesquels"},{"$f":"IF(Questionnaire!F64=FALSE,\"\",\"Contre les chevreuils et les rongeurs\")","v":""}]
[]
[{"$f":"Questionnaire!B78","v":"Section 3 : Perte d'espace cultivable "},{"$f":"IF(Questionnaire!#REF!=FALSE,\"\",\"Contre les rongeurs seulement\")","v":{"$error":"#REF!"}}]
[{"$f":"Questionnaire!B81","v":"Quelle est la longueur de la haie implantée dans un champ cultivé ?"},{"$f":"Questionnaire!G81","v":0}]
[{"$f":"Questionnaire!B83","v":"Quelle est la durée de la rotation de culture ?"},{"$f":"Questionnaire!G83","v":0}]
[{"$f":"Questionnaire!B85","v":"Quelle est la rotation de culture ?"}]
[{"$f":"Questionnaire!B87","v":"1re"},{"$f":"Questionnaire!C$87","v":"..."}]
[{"$f":"Questionnaire!B88","v":"2e"},{"$f":"Questionnaire!C$88","v":"..."}]
[{"$f":"Questionnaire!B89","v":"3e"},{"$f":"Questionnaire!C$89","v":"..."}]
[{"$f":"Questionnaire!D87","v":"4e"},{"$f":"Questionnaire!E$87","v":"..."}]
[{"$f":"Questionnaire!D88","v":"5e"},{"$f":"Questionnaire!E$88","v":"..."}]
[{"$f":"Questionnaire!D89","v":"6e"},{"$f":"Questionnaire!E$89","v":"..."}]
[{"$f":"Questionnaire!F87","v":"7e"},{"$f":"Questionnaire!G$87","v":"..."}]
[{"$f":"Questionnaire!F88","v":"8e"},{"$f":"Questionnaire!G$88","v":"..."}]
[{"$f":"Questionnaire!F89","v":"9e"},{"$f":"Questionnaire!G$89","v":"..."}]
[]
[{"$f":"Questionnaire!B91","v":"Section 4 : Chauffage des bâtiments d'élevage"}]
[{"$f":"Questionnaire!B93","v":"Quels sont les coûts annuels de chauffage des bâtiments qui seront protégés?"},{"$f":"Questionnaire!H93","v":0}]
[{"$f":"Questionnaire!B95","v":"Quel est le type de ventilation de votre bâtiment?"},{"$f":" IF(Langue!A200=\"FR\",CONCATENATE(IF(AND(Questionnaire!G95=FALSE,Questionnaire!H95=FALSE),\"N/D\",\"\"),IF(AND(Questionnaire!G95=TRUE,Questionnaire!H95=FALSE),\"Forcée\",\"\"),IF(AND(Questionnaire!G95=FALSE,Questionnaire!H95=TRUE),\"Naturelle\",\"\")),CONCATENATE(IF(AND(Questionnaire!G95=FALSE,Questionnaire!H95=FALSE),\"N/D\",\"\"),IF(AND(Questionnaire!G95=TRUE,Questionnaire!H95=FALSE),\"Fan\",\"\"),IF(AND(Questionnaire!G95=FALSE,Questionnaire!H95=TRUE),\"Natural\",\"\")))","v":"N/D"}]
[{"$f":"Questionnaire!B97","v":"À quel pourcentage s'élèveront les économies de chauffage à la maturité des haies ?"},{"$f":"Questionnaire!H97","v":0.1}]
[]
[{"$f":"Questionnaire!B99","v":"Section 5 : Déneigement"}]
[{"$f":"Questionnaire!B101","v":"Combien d'heures par année sont consacrées aux opérations de déneigement dans le secteur qui sera protégé par la haie ?"},{"$f":"Questionnaire!H102","v":0}]
[{"$f":"Questionnaire!B104","v":"Taux horaire pour les opérations de déneigement ?"},{"$f":"Questionnaire!H104","v":85}]
[]
[{"$f":"Questionnaire!B106","v":"Section 6 : Récolte de bois"}]
[{"$f":"Questionnaire!B109","v":"Quelle espèce prévoyez-vous récolter ?"}]
[{"$f":"Questionnaire!D$49","v":"Peupliers hybrides (PEH)"},{"$f":"Questionnaire!C111","v":false}]
[{"$f":"Questionnaire!D$48","v":"Épinettes, Pins ou Thuyas (CON)"},{"$f":"Questionnaire!C112","v":false}]
[{"$f":"Questionnaire!D$50","v":"Feuillus nobles (FNO)"},{"$f":"Questionnaire!C113","v":false}]
[{"$f":"Questionnaire!D$52","v":"Saules hybrides (SAH)"},{"$f":"Questionnaire!C114","v":false}]
[{"$f":"Questionnaire!F109","v":"À quelle fin destinez-vous le bois?"}]
[{"$f":"Questionnaire!D$49","v":"Peupliers hybrides (PEH)"},{"$f":"Questionnaire!F111","v":"Sciage"}]
[{"$f":"Questionnaire!D$48","v":"Épinettes, Pins ou Thuyas (CON)"},{"$f":"Questionnaire!F112","v":"Sciage"}]
[{"$f":"Questionnaire!D$50","v":"Feuillus nobles (FNO)"},{"$f":"Questionnaire!F113","v":"Sciage"}]
[{"$f":"Questionnaire!D$52","v":"Saules hybrides (SAH)"},{"$f":"Questionnaire!F114","v":"Pâte ou biomasse"}]
[{"$f":"Questionnaire!B116","v":"Quel pourcentage de marge brute prévoyez-vous en retirer ?"}]
[{"$f":"Questionnaire!D$49","v":"Peupliers hybrides (PEH)"},{"$f":"Questionnaire!G117","v":0.35}]
[{"$f":"Questionnaire!D$48","v":"Épinettes, Pins ou Thuyas (CON)"},{"$f":"Questionnaire!G118","v":0.35}]
[{"$f":"Questionnaire!D$50","v":"Feuillus nobles (FNO)"},{"$f":"Questionnaire!G119","v":0.35}]
[{"$f":"Questionnaire!D$52","v":"Saules hybrides (SAH)"},{"$f":"Questionnaire!G120","v":0.35}]
[]
[{"$f":"Questionnaire!B122","v":"Section 7 : Récolte de petits fruits"}]
[{"$f":"Questionnaire!B124","v":"Parmi les arbustes que vous désirez établir, quel pourcentage sont des arbustes fruitiers ?"},{"$f":"Questionnaire!H124","v":0}]
[{"$f":"Questionnaire!B126","v":"Prévoyez-vous récolter des fruits ?"},{"$f":"Questionnaire!F126","v":"Non"}]
[{"$f":"Questionnaire!B129","v":"Si oui, combien de kg par plant ?"},{"$f":"Questionnaire!F129","v":1.25}]
[{"$f":"Questionnaire!B131","v":"À quel prix ?"},{"$f":"Questionnaire!F131","v":0.8}]
[{"$f":"Questionnaire!B133","v":"Quel pourcentage de marge brute prévoyez-vous en retirer ?"},{"$f":"Questionnaire!F133","v":0.2}]
[]
[{"$f":"Questionnaire!B135","v":"Section 8 : Pertes de sol "}]
[{"$f":"Questionnaire!B138","v":"À combien évaluez-vous la valeur des pertes de sol ?"},{"$f":"Questionnaire!F138","v":"0"}]
[]
[{"$f":"Questionnaire!B141","v":"Section 9 : Amélioration des rendements de culture "}]
[{"$f":"Questionnaire!B144","v":"Est-ce que la haie offrira une protection pour les cultures ?"},{"$f":"Questionnaire!F144","v":"Non"}]
[{"$f":"Questionnaire!B149","v":"Sur quel multiple de la hauteur (H) l'augmentation de rendement est-elle perceptible ?"},{"$f":"Questionnaire!H149","v":"0"}]
[{"$f":"Questionnaire!B151","v":"Quel pourcentage d'amélioration de rendement anticipez-vous ?"},{"$f":"Questionnaire!F151","v":2.5}]
[]
[{"$f":"Questionnaire!B153","v":"Section 10 : Crédits de carbone"}]
[{"$f":"Questionnaire!B155","v":"À combien évaluez-vous le prix de la réduction d’une tonne des GES ?"},{"$f":"Questionnaire!G155","v":0}]
[{"$f":"'Bilan des calculs'!J5","v":"Carbone séquestré (tonnes de CO² équivalent) après 40 ans"},{"$f":"'Bilan des calculs'!M5","v":0}]
[]
[{"$f":"IF(Langue!$A$200 = \"FR\",Dictionnaire!A693,Dictionnaire!B693)","v":"Bilan des calculs"}]
[{"$f":"IF(Langue!$A$200 = \"FR\",Dictionnaire!A694,Dictionnaire!B694)","v":"Marge actualisée cumulative"}]
[{"$f":"'Bilan des calculs'!C12","v":"0-5 ans"},{"$f":"'Bilan des calculs'!L12","v":-75.822548140182846}]
[{"$f":"'Bilan des calculs'!C13","v":"5-10 ans"},{"$f":"'Bilan des calculs'!L13","v":-75.822548140182846}]
[{"$f":"'Bilan des calculs'!C14","v":"10-20 ans"},{"$f":"'Bilan des calculs'!L14","v":-75.822548140182846}]
[{"$f":"'Bilan des calculs'!C15","v":"20-40 ans"},{"$f":"'Bilan des calculs'!L15","v":-75.822548140182846}]
[{"$f":"IF(Langue!$A$200 = \"FR\",Dictionnaire!A699,Dictionnaire!B699)","v":"Coûts"}]
[{"$f":"'Graphique coûts-revenus'!AE53","v":"Coûts liés à l'implantation des écrans boisés"},{"$f":"'Graphique coûts-revenus'!AF53","v":0}]
[{"$f":"'Graphique coûts-revenus'!AE54","v":"Coûts liés aux pertes d'espace cultivable"},{"$f":"'Graphique coûts-revenus'!AF54","v":0}]
[{"$f":"'Graphique coûts-revenus'!AE55","v":"Coûts liés à l'entretien des écrans boisés"},{"$f":"'Graphique coûts-revenus'!AF55","v":-75.822548140182846}]
[{"$f":"IF(Langue!$A$200 = \"FR\",Dictionnaire!A703,Dictionnaire!B703)","v":"Bénéfices"}]
[{"$f":"'Graphique coûts-revenus'!$AE$59","v":"Revenus liés aux économies de chauffage"},{"$f":"'Graphique coûts-revenus'!AF59","v":0}]
[{"$f":"'Graphique coûts-revenus'!AE60","v":"Revenus liés aux économies de déneigement"},{"$f":"'Graphique coûts-revenus'!AF60","v":0}]
[{"$f":"'Graphique coûts-revenus'!AE61","v":"Revenus liés à la production de petits fruits"},{"$f":"'Graphique coûts-revenus'!AF61","v":0}]
[{"$f":"'Graphique coûts-revenus'!AE62","v":"Revenus liés à la récolte du bois"},{"$f":"'Graphique coûts-revenus'!AF62","v":0}]
[{"$f":"'Graphique coûts-revenus'!AE63","v":"Revenus liés à l'augmentation de rendement"},{"$f":"'Graphique coûts-revenus'!AF63","v":0}]
[{"$f":"'Graphique coûts-revenus'!AE64","v":"Économies liées diminutions de pertes de sol"},{"$f":"'Graphique coûts-revenus'!AF64","v":0}]
[{"$f":"'Graphique coûts-revenus'!AE65","v":"Revenus liés aux crédits carbone"},{"$f":"'Graphique coûts-revenus'!AF65","v":0}]
[{"$f":"CONCATENATE('Bilan des calculs'!B98,\" (\",'Bilan des calculs'!G98,\")\")","v":"Délai de récupération (ans)"},{"$f":"'Bilan des calculs'!F98","v":"> 40"}]

{"sheet":"Devis d'implantation des écrans","index":14,"n_rows":821,"n_cols":27,"rows_kept":821,"cut":false,"hidden":false,"merged":[[61,15,61,17],[26,4,26,6],[52,0,52,3],[53,0,53,3],[66,11,66,13],[67,11,67,13],[68,11,68,13],[63,5,63,7],[63,8,63,10],[63,11,63,13],[54,0,54,4],[63,0,63,4],[64,0,64,4],[20,0,26,0],[20,1,20,3],[20,4,20,6],[21,1,21,3],[21,4,21,6],[22,1,22,3],[66,0,66,4],[67,0,67,4],[68,0,68,4],[66,5,66,7],[28,1,28,3],[28,4,28,6],[29,1,29,3],[29,4,29,6],[66,8,66,10],[67,8,67,10],[68,8,68,10],[69,8,69,10],[56,0,56,4],[56,5,56,7],[33,4,33,6],[34,1,34,3],[34,4,34,6],[35,1,35,3],[69,5,69,7],[59,0,59,4],[59,5,59,7],[59,8,59,10],[60,0,60,4],[60,5,60,7],[60,8,60,10],[61,0,61,4],[61,5,61,7],[61,8,61,10],[67,5,67,7],[6,0,6,4],[6,5,6,11],[52,8,52,10],[53,8,53,10],[52,11,52,13],[53,11,53,13],[52,5,52,7],[53,5,53,7],[26,1,26,3],[35,4,35,6],[30,0,32,0],[30,1,30,3],[30,4,30,6],[31,1,31,3],[31,4,31,6],[32,1,32,3],[32,4,32,6],[27,0,29,0],[27,1,27,3],[27,4,27,6],[49,0,49,4],[49,5,49,7],[49,8,49,10],[49,11,49,13],[18,17,19,17],[73,0,73,10],[73,11,73,13],[24,1,24,3],[24,4,24,6],[65,5,65,7],[65,8,65,10],[64,5,64,7],[64,8,64,10],[40,0,40,2],[40,3,40,16],[47,15,47,17],[46,14,46,16],[46,0,46,2],[46,5,46,11],[38,0,38,4],[39,0,39,2],[39,14,39,16],[33,0,35,0],[33,1,33,3],[54,5,54,7],[22,4,22,6],[23,1,23,3],[23,4,23,6],[59,11,59,13],[60,11,60,13],[61,11,61,13],[56,8,56,10],[56,11,56,13],[57,0,57,4],[57,5,57,7],[57,8,57,10],[57,11,57,13],[58,0,58,4],[58,5,58,7],[58,8,58,10],[58,11,58,13],[54,8,54,10],[54,11,54,13],[51,5,51,7],[51,8,51,10],[51,11,51,13],[50,0,50,2],[50,5,50,7],[50,8,50,10],[50,11,50,13],[51,0,51,3],[88,15,88,17],[75,11,75,13],[65,0,65,4],[75,0,75,10],[82,15,82,17],[76,0,76,5],[87,12,87,14],[87,15,87,17],[78,15,78,17],[77,0,77,5],[75,15,75,17],[70,15,70,17],[70,11,70,13],[69,11,69,13],[70,5,70,7],[77,15,77,17],[81,15,81,17],[85,15,85,17],[74,0,74,9],[74,11,74,13],[70,8,70,10],[69,0,69,4],[70,0,70,4],[68,5,68,7],[5,0,5,4],[5,14,5,16],[3,0,3,4],[3,5,3,7],[3,8,3,10],[3,11,3,13],[4,0,4,4],[4,6,4,7],[4,12,4,13],[4,15,4,16],[25,4,25,6],[12,0,12,4],[7,14,7,16],[8,14,8,16],[9,0,9,4],[9,14,9,16],[8,0,8,4],[7,0,7,4],[10,0,10,4],[11,0,11,4],[7,5,7,11],[14,1,16,16],[19,1,19,3],[19,4,19,6],[25,1,25,3],[18,7,18,16],[102,10,102,12],[91,4,91,10],[99,12,99,14],[99,15,99,17],[94,15,94,17],[95,15,95,17],[100,15,100,17],[97,15,97,17],[0,0,0,17],[2,0,2,4],[2,5,2,6],[2,10,2,14],[2,15,2,16],[4,9,4,10],[3,14,3,16],[54,15,54,17],[65,11,65,13],[64,11,64,13],[5,5,5,11],[8,5,8,11],[9,5,9,11],[37,14,37,16],[37,5,37,11],[39,5,39,11]]}
[]
[null,null,null,null,null,null,null,null,null,null,null,null,null,null,null,null,null,null,null,null,null,null,"Type de collerettes",null,"Temps de pose (min/unité)"]
[null,null,null,null,null,null,null,null,null,null,"Longueur totale plantée (m)",null,null,null,null,{"$f":"F6*F8","v":0},null,null,null,null,null,null,"Déroulé en longueur",{"$f":"A52","v":"Petite collerette (30 cm X 30 cm)"},3]
[null,null,null,null,null,null,null,null,null,null,null,null,null,null,null,null,null,null,null,null,null,null,"Grandes collerettes",{"$f":"A53","v":"Grande collerette (1 m X 1 m)"},5]
[null,null,null,null,null,null,null,null,null,null,null,null,null,null,null,null,null,null,null,null,null,null,"Biodisques",{"$f":"A54","v":"Biodisque (60 cm)"},4]
["Longueur de la haie (m)",null,null,null,null,{"$f":"Questionnaire!E16","v":0}]
["Type de paillis",null,null,null,null,{"$f":"Questionnaire!D43","v":"Déroulé en longueur"}]
["Nombre de rangées",null,null,null,null,{"$f":"Questionnaire!E18","v":0},null,null,null,null,null,null,null,null,null,null,null,null,null,null,null,null,"Format de plants","Temps de pose (min/unité)"]
["Longueur déroulée (m)",null,null,null,null,{"$f":"IF(F7=Questionnaire!AC45,F6*F8,0)","v":0},null,null,null,null,null,null,null,null,null,null,null,null,null,null,null,null,"Boutures",0.5]
["Espacement entre les rangs (m)",null,null,null,null,{"$f":"Questionnaire!E20","v":0},null,null,null,null,null,null,null,null,null,null,null,null,null,null,null,null,"Racines nues 30 à 60 cm de hauteur",3]
["Numéro de la rangée",null,null,null,null,1,2,3,4,5,6,7,null,null,null,null,null,null,null,null,null,null,"45 cavités",2]
["Espacement entre les végétaux (m)",null,null,null,null,{"$f":"IF(Questionnaire!$E18>0,Questionnaire!$C35,0)","v":0},{"$f":"IF(Questionnaire!$E18>1,Questionnaire!$C36,0)","v":0},{"$f":"IF(Questionnaire!$E18>2,Questionnaire!$C37,0)","v":0},{"$f":"IF(Questionnaire!$E18>3,Questionnaire!$C38,0)","v":0},{"$f":"IF(Questionnaire!$E18>4,Questionnaire!$C39,0)","v":0},{"$f":"IF(Questionnaire!$E18>5,Questionnaire!$C40,0)","v":0},{"$f":"IF(Questionnaire!$E18>6,Questionnaire!$C41,0)","v":0},null,null,null,null,null,null,null,null,null,null,"25 cavités (PFD)",3]
["Nombre de végétaux",null,null,null,null,{"$f":"IF(F12>0,$F6/F12,0)","v":0},{"$f":"IF(G12>0,$F6/G12,0)","v":0},0,0,0,0,0,null,null,null,null,null,null,null,null,null,null,"Pots 1 gallon",5]
[null,null,null,null,"Densité réellle",{"$f":"IF($F6=0,0,F13/$F6)","v":0},0,0,0,0,0,0,null,null,null,null,null,null,null,null,null,null,"Pots 2 gallons",7]
[]
[null,null,null,null,null,null,null,null,null,null,null,null,null,null,null,null,null,null,null,null,null,null,"Protecteurs","Temps de pose (min/unité)"]
[null,null,null,null,null,null,null,null,null,null,null,null,null,null,null,null,null,null,null,null,null,null,"Protecteurs à mulots",2]
[null,null,null,null,null,null,null,null,null,null,null,null,null,null,null,null,null,null,null,null,null,null,"Protecteurs à chevreuils",10]
["Arrangement des végétaux",null,null,null,null,null,null,"Séquence d'arbres et/ou arbustes",null,null,null,null,null,null,null,null,null,"Nombre de répétition par espèce",null,null,null,null,"Structures pour la faune et auxiliaires",10]
["Haie","Rangée",null,null,"Longueur",null,null,1,2,3,4,5,6,7,8,9,10]
["A",1,null,null,{"$f":"IF($F$8>=1,$F$6,0)","v":0},null,null,{"$f":"IF($F$8<1,\"\",(IF(Questionnaire!C25=\"\",\"\",Questionnaire!C25)))","v":""},{"$f":"IF($F$8<1,\"\",(IF(Questionnaire!D25=\"\",\"\",Questionnaire!D25)))","v":""},{"$f":"IF($F$8<1,\"\",(IF(Questionnaire!E25=\"\",\"\",Questionnaire!E25)))","v":""},{"$f":"IF($F$8<1,\"\",(IF(Questionnaire!F25=\"\",\"\",Questionnaire!F25)))","v":""},{"$f":"IF($F$8<1,\"\",(IF(Questionnaire!G25=\"\",\"\",Questionnaire!G25)))","v":""},{"$f":"IF($F$8<1,\"\",(IF(Questionnaire!H25=\"\",\"\",Questionnaire!H25)))","v":""},{"$f":"IF($F$8<1,\"\",(IF(Questionnaire!I25=\"\",\"\",Questionnaire!I25)))","v":""},null,null,null,{"$f":"ROUNDUP(IF(COUNTIF(H21:N21,\"\")=7,0,F$13/(7-(COUNTIF(H21:N21,\"\")))),0)","v":0}]
[null,2,null,null,{"$f":"IF($F$8>=2,$F$6,0)","v":0},null,null,{"$f":"IF($F$8<2,\"\",(IF(Questionnaire!C26=\"\",\"\",Questionnaire!C26)))","v":""},{"$f":"IF($F$8<2,\"\",(IF(Questionnaire!D26=\"\",\"\",Questionnaire!D26)))","v":""},{"$f":"IF($F$8<2,\"\",(IF(Questionnaire!E26=\"\",\"\",Questionnaire!E26)))","v":""},{"$f":"IF($F$8<2,\"\",(IF(Questionnaire!F26=\"\",\"\",Questionnaire!F26)))","v":""},{"$f":"IF($F$8<2,\"\",(IF(Questionnaire!G26=\"\",\"\",Questionnaire!G26)))","v":""},{"$f":"IF($F$8<2,\"\",(IF(Questionnaire!H26=\"\",\"\",Questionnaire!H26)))","v":""},{"$f":"IF($F$8<2,\"\",(IF(Questionnaire!I26=\"\",\"\",Questionnaire!I26)))","v":""},null,null,null,{"$f":"ROUNDUP(IF(COUNTIF(H22:N22,\"\")=7,0,G$13/(7-(COUNTIF(H22:N22,\"\")))),0)","v":0},null,null,null,null,"Travaux forfaitaires"]
[null,3,null,null,{"$f":"IF($F$8>=3,$F$6,0)","v":0},null,null,{"$f":"IF($F$8<3,\"\",(IF(Questionnaire!C27=\"\",\"\",Questionnaire!C27)))","v":""},{"$f":"IF($F$8<3,\"\",(IF(Questionnaire!D27=\"\",\"\",Questionnaire!D27)))","v":""},{"$f":"IF($F$8<3,\"\",(IF(Questionnaire!E27=\"\",\"\",Questionnaire!E27)))","v":""},{"$f":"IF($F$8<3,\"\",(IF(Questionnaire!F27=\"\",\"\",Questionnaire!F27)))","v":""},{"$f":"IF($F$8<3,\"\",(IF(Questionnaire!G27=\"\",\"\",Questionnaire!G27)))","v":""},{"$f":"IF($F$8<3,\"\",(IF(Questionnaire!H27=\"\",\"\",Questionnaire!H27)))","v":""},{"$f":"IF($F$8<3,\"\",(IF(Questionnaire!I27=\"\",\"\",Questionnaire!I27)))","v":""},null,null,null,{"$f":"ROUNDUP(IF(COUNTIF(H23:N23,\"\")=7,0,H$13/(7-(COUNTIF(H23:N23,\"\")))),0)","v":0},null,null,null,null,"Travail du sol et déroulage",1.5,"/m"]
[null,4,null,null,{"$f":"IF($F$8>=4,$F$6,0)","v":0},null,null,{"$f":"IF($F$8<4,\"\",(IF(Questionnaire!C28=\"\",\"\",Questionnaire!C28)))","v":""},{"$f":"IF($F$8<4,\"\",(IF(Questionnaire!D28=\"\",\"\",Questionnaire!D28)))","v":""},{"$f":"IF($F$8<4,\"\",(IF(Questionnaire!E28=\"\",\"\",Questionnaire!E28)))","v":""},{"$f":"IF($F$8<4,\"\",(IF(Questionnaire!F28=\"\",\"\",Questionnaire!F28)))","v":""},{"$f":"IF($F$8<4,\"\",(IF(Questionnaire!G28=\"\",\"\",Questionnaire!G28)))","v":""},{"$f":"IF($F$8<4,\"\",(IF(Questionnaire!H28=\"\",\"\",Questionnaire!H28)))","v":""},{"$f":"IF($F$8<4,\"\",(IF(Questionnaire!I28=\"\",\"\",Questionnaire!I28)))","v":""},null,null,null,{"$f":"ROUNDUP(IF(COUNTIF(H24:N24,\"\")=7,0,I$13/(7-(COUNTIF(H24:N24,\"\")))),0)","v":0},null,null,null,null,"Frais de déplacement",120,"/h"]
[null,5,null,null,{"$f":"IF($F$8>=5,$F$6,0)","v":0},null,null,{"$f":"IF($F$8<5,\"\",(IF(Questionnaire!C29=\"\",\"\",Questionnaire!C29)))","v":""},{"$f":"IF($F$8<5,\"\",(IF(Questionnaire!D29=\"\",\"\",Questionnaire!D29)))","v":""},{"$f":"IF($F$8<5,\"\",(IF(Questionnaire!E29=\"\",\"\",Questionnaire!E29)))","v":""},{"$f":"IF($F$8<5,\"\",(IF(Questionnaire!F29=\"\",\"\",Questionnaire!F29)))","v":""},{"$f":"IF($F$8<5,\"\",(IF(Questionnaire!G29=\"\",\"\",Questionnaire!G29)))","v":""},{"$f":"IF($F$8<5,\"\",(IF(Questionnaire!H29=\"\",\"\",Questionnaire!H29)))","v":""},{"$f":"IF($F$8<5,\"\",(IF(Questionnaire!I29=\"\",\"\",Questionnaire!I29)))","v":""},null,null,null,{"$f":"ROUNDUP(IF(COUNTIF(H25:N25,\"\")=7,0,J$13/(7-(COUNTIF(H25:N25,\"\")))),0)","v":0},null,null,null,null,"Travaux fait par producteur",0.6,"/m"]
[null,6,null,null,{"$f":"IF($F$8>=6,$F$6,0)","v":0},null,null,{"$f":"IF($F$8<6,\"\",(IF(Questionnaire!C30=\"\",\"\",Questionnaire!C30)))","v":""},{"$f":"IF($F$8<6,\"\",(IF(Questionnaire!D30=\"\",\"\",Questionnaire!D30)))","v":""},{"$f":"IF($F$8<6,\"\",(IF(Questionnaire!E30=\"\",\"\",Questionnaire!E30)))","v":""},{"$f":"IF($F$8<6,\"\",(IF(Questionnaire!F30=\"\",\"\",Questionnaire!F30)))","v":""},{"$f":"IF($F$8<6,\"\",(IF(Questionnaire!G30=\"\",\"\",Questionnaire!G30)))","v":""},{"$f":"IF($F$8<6,\"\",(IF(Questionnaire!H30=\"\",\"\",Questionnaire!H30)))","v":""},{"$f":"IF($F$8<6,\"\",(IF(Questionnaire!I30=\"\",\"\",Questionnaire!I30)))","v":""},null,null,null,{"$f":"ROUNDUP(IF(COUNTIF(H26:N26,\"\")=7,0,K$13/(7-(COUNTIF(H26:N26,\"\")))),0)","v":0},null,null,null,null,"Vitesse moyenne de déplacement",80,"km/h"]
[null,7,null,null,{"$f":"IF($F$8>=7,$F$6,0)","v":0},null,null,{"$f":"IF($F$8<7,\"\",(IF(Questionnaire!C31=\"\",\"\",Questionnaire!C31)))","v":""},{"$f":"IF($F$8<7,\"\",(IF(Questionnaire!D31=\"\",\"\",Questionnaire!D31)))","v":""},{"$f":"IF($F$8<7,\"\",(IF(Questionnaire!E31=\"\",\"\",Questionnaire!E31)))","v":""},{"$f":"IF($F$8<7,\"\",(IF(Questionnaire!F31=\"\",\"\",Questionnaire!F31)))","v":""},{"$f":"IF($F$8<7,\"\",(IF(Questionnaire!G31=\"\",\"\",Questionnaire!G31)))","v":""},{"$f":"IF($F$8<7,\"\",(IF(Questionnaire!H31=\"\",\"\",Questionnaire!H31)))","v":""},{"$f":"IF($F$8<7,\"\",(IF(Questionnaire!I31=\"\",\"\",Questionnaire!I31)))","v":""},null,null,null,{"$f":"ROUNDUP(IF(COUNTIF(H27:N27,\"\")=7,0,L$13/(7-(COUNTIF(H27:N27,\"\")))),0)","v":0},null,null,null,null,"Longueur plastique 4 pieds",457,"m"]
["B",1,null,null,{"$f":"IF($I$8>=1,$I$6,0)","v":0},null,null,null,null,null,null,null,null,null,null,null,null,{"$f":"ROUNDUP(IF(COUNTIF(H28:Q28,\"\")=10,0,F$13/(10-(COUNTIF(H28:Q28,\"\")))),0)","v":0},null,null,null,null,"Longueur plastique 5 pieds",365,"m"]
[null,2,null,null,{"$f":"IF($I$8>=2,$I$6,0)","v":0},null,null,null,null,null,null,null,null,null,null,null,null,0,null,null,null,null,"Frais de déplacement",{"$f":"Paramètres!I30","v":0.5},"/km"]
[null,3,null,null,{"$f":"IF($I$8>=3,$I$6,0)","v":0},null,null,null,null,null,null,null,null,null,null,null,null,0]
["C",1,null,null,{"$f":"IF($L$8>=1,$L$6,0)","v":0},null,null,null,null,null,null,null,null,null,null,null,null,0]
[null,2,null,null,{"$f":"IF($L$8>=2,$L$6,0)","v":0},null,null,null,null,null,null,null,null,null,null,null,null,0,null,null,null,null,"Cacul du nombre de jour","Nombre d'heure totales","Nombre de personnes","Nombre d'heure/personne","Nombre de jours"]
[null,3,null,null,{"$f":"IF($L$8>=3,$L$6,0)","v":0},null,null,null,null,null,null,null,null,null,null,null,null,0,null,null,null,null,"Plantation",{"$f":"(F47*X10/60)","v":0},4,{"$f":"X33/Y33","v":0},{"$f":"ROUNDUP(Z33/8,0)","v":0}]
["D",1,null,null,{"$f":"IF($O$8>=1,$O$6,0)","v":0},null,null,null,null,null,null,null,null,null,null,null,null,0,null,null,null,null,"Pose petites collerettes et broches",{"$f":"((F52*Y3/60))","v":0},4,{"$f":"X34/Y34","v":0},{"$f":"ROUNDUP(Z34/8,0)","v":0}]
[null,2,null,null,{"$f":"IF($O$8>=2,$O$6,0)","v":0},null,null,null,null,null,null,null,null,null,null,null,null,0,null,null,null,null,"Pose grandes collerettes et broches",{"$f":"((F53*Y4/60))","v":0},4,0,0]
[null,3,null,null,{"$f":"IF($O$8>=3,$O$6,0)","v":0},null,null,null,null,null,null,null,null,null,null,null,null,0,null,null,null,null,"Pose biodisques et broches",{"$f":"((F54*Y5/60))","v":0},4,0,0]
[null,null,null,null,null,null,null,null,null,null,null,null,null,null,null,null,null,null,null,null,null,null,"Pose protecteurs à mulots",{"$f":"(F58*X17/60)","v":0},4,0,0]
[null,null,null,null,null,"A",null,null,null,null,null,null,null,null,"D",null,null,null,null,null,null,null,"Pose protecteurs à chevreuils",{"$f":"(F59*X18/60)","v":0},4,0,0]
["# rangée",null,null,null,null,1,2,3,4,5,6,7,2,3,1,2,3,null,null,null,null,null,"Pose structures pour la faune et auxiliaires",{"$f":"(SUM(F60:H62)*X19/60)","v":0},4,0,0]
["Essences",null,null,"Total","$/unité","quantité",null,null,null,null,null,null,null,null,"quantité"]
["Arbres*",null,null,null,null,null,null,null,null,null,null,null,null,null,null,null,null,"Total ($)",null,"Subvention arbres"]
["Épinettes, Pins ou Thuyas",null,{"$f":"IF(Langue!$A$200 = \"FR\",Dictionnaire!A808,Dictionnaire!B808)","v":"CON"},{"$f":"SUM(F42:L42)","v":0},{"$f":"Questionnaire!E48","v":9},{"$f":"COUNTIF(H$21:N$21,$C42)*$R$21","v":0},{"$f":"COUNTIF(H$22:N$22,$C42)*$R$22","v":0},{"$f":"COUNTIF(H$23:N$23,$C42)*$R$23","v":0},{"$f":"COUNTIF(H$24:N$24,$C42)*$R$24","v":0},{"$f":"COUNTIF(H$25:N$25,$C42)*$R$25","v":0},{"$f":"COUNTIF(H$26:N$26,$C42)*$R$26","v":0},{"$f":"COUNTIF(H$27:N$27,$C42)*$R$27","v":0},null,null,null,null,null,{"$f":"E42*D42","v":0},null,{"$f":"MIN(D42*Z$78,D42*E42)","v":0},null,null,"Données provenant de la subvention Prime-Vert"]
["Peupliers hybrides",null,{"$f":"IF(Langue!$A$200 = \"FR\",Dictionnaire!A809,Dictionnaire!B809)","v":"PEH"},{"$f":"SUM(F43:L43)","v":0},{"$f":"Questionnaire!E49","v":9},{"$f":"COUNTIF(H$21:N$21,$C43)*$R$21","v":0},{"$f":"COUNTIF(H$22:N$22,$C43)*$R$22","v":0},{"$f":"COUNTIF(H$23:N$23,$C43)*$R$23","v":0},{"$f":"COUNTIF(H$24:N$24,$C43)*$R$24","v":0},{"$f":"COUNTIF(H$25:N$25,$C43)*$R$25","v":0},{"$f":"COUNTIF(H$26:N$26,$C43)*$R$26","v":0},{"$f":"COUNTIF(H$27:N$27,$C43)*$R$27","v":0},null,null,null,null,null,{"$f":"E43*D43","v":0},null,{"$f":"MIN(D43*Z$78,D43*E43)","v":0},null,null,7.5,"maximum par mètre linéraire aménagé"]
["Feuillus nobles",null,{"$f":"IF(Langue!$A$200 = \"FR\",Dictionnaire!A810,Dictionnaire!B810)","v":"FNO"},{"$f":"SUM(F44:L44)","v":0},{"$f":"Questionnaire!E50","v":9},{"$f":"COUNTIF(H$21:N$21,$C44)*$R$21","v":0},{"$f":"COUNTIF(H$22:N$22,$C44)*$R$22","v":0},{"$f":"COUNTIF(H$23:N$23,$C44)*$R$23","v":0},{"$f":"COUNTIF(H$24:N$24,$C44)*$R$24","v":0},{"$f":"COUNTIF(H$25:N$25,$C44)*$R$25","v":0},{"$f":"COUNTIF(H$26:N$26,$C44)*$R$26","v":0},{"$f":"COUNTIF(H$27:N$27,$C44)*$R$27","v":0},null,null,null,null,null,{"$f":"E44*D44","v":0},null,{"$f":"MIN(D44*Z$78,D44*E44)","v":0},null,null,12,"maximum par végétaux"]
["Arbustes",null,{"$f":"IF(Langue!$A$200 = \"FR\",Dictionnaire!A811,Dictionnaire!B811)","v":"ARB"},{"$f":"SUM(F45:L45)","v":0},{"$f":"Questionnaire!E51","v":9},{"$f":"COUNTIF(H$21:N$21,$C45)*$R$21","v":0},{"$f":"COUNTIF(H$22:N$22,$C45)*$R$22","v":0},{"$f":"COUNTIF(H$23:N$23,$C45)*$R$23","v":0},{"$f":"COUNTIF(H$24:N$24,$C45)*$R$24","v":0},{"$f":"COUNTIF(H$25:N$25,$C45)*$R$25","v":0},{"$f":"COUNTIF(H$26:N$26,$C45)*$R$26","v":0},{"$f":"COUNTIF(H$27:N$27,$C45)*$R$27","v":0},null,null,null,null,null,{"$f":"E45*D45","v":0},null,{"$f":"MIN(D45*Z$78,D45*E45)","v":0},null,null,1.1599999999999999,"maximum protection contre les rongeurs"]
["Saules hybrides",null,{"$f":"IF(Langue!$A$200 = \"FR\",Dictionnaire!A812,Dictionnaire!B812)","v":"SAH"},{"$f":"SUM(F46:L46)","v":0},{"$f":"Questionnaire!E52","v":0.5},{"$f":"COUNTIF(H$21:N$21,$C46)*$R$21","v":0},{"$f":"COUNTIF(H$22:N$22,$C46)*$R$22","v":0},{"$f":"COUNTIF(H$23:N$23,$C46)*$R$23","v":0},{"$f":"COUNTIF(H$24:N$24,$C46)*$R$24","v":0},{"$f":"COUNTIF(H$25:N$25,$C46)*$R$25","v":0},{"$f":"COUNTIF(H$26:N$26,$C46)*$R$26","v":0},{"$f":"COUNTIF(H$27:N$27,$C46)*$R$27","v":0},null,null,null,null,null,{"$f":"E46*D46","v":0},null,{"$f":"MIN(D46*Z$78,D46*E46)","v":0},null,null,7.5,"maximum protection contre les cervidés"]
["Nombre total de végétaux ",null,null,{"$f":"SUM(D42:D46)","v":0},null,{"$f":"SUM(F42:L46)","v":0},null,null,null,null,null,null,null,null,null,null,null,null,null,null,null,null,0,"maximum structures pour la faune et auxiliaires"]
[null,null,null,null,null,null,null,null,null,null,null,null,null,null,"Total",{"$f":"SUM(R42:R46)","v":0},null,null,null,{"$f":"SUM(T42:T47)","v":0},null,null,800,"maximum pour la conception des plans et devis"]
[null,null,null,null,null,null,null,null,null,null,null,null,null,null,null,null,null,null,null,null,null,null,0.7,"pourcentage de subvention Prime-Vert"]
["MATÉRIEL",null,null,null,null,"Quantité",null,null,"Coût unitaire ($)",null,null,"Coût total ($)"]
[{"$f":"Paramètres!B24","v":"Rouleau de pailllis de plastique de 1,2 ou 1,5 m de large"},null,null,{"$f":"Questionnaire!G43","v":"4"},{"$f":"IF(D51=\"4\",\" \",\"x\")","v":" "},{"$f":"IF(E51=\"x\",F9/365,F9/457)","v":0},null,null,288,null,null,{"$f":"ROUNDUP(F51,1)*I51","v":0}]
[{"$f":"Paramètres!B25","v":"Petite collerette (30 cm X 30 cm)"},null,null,null,{"$f":"Paramètres!F25","v":2},{"$f":"SUMIF(F$7,Questionnaire!AC45,F$42:L$45)","v":0},null,null,{"$f":"Paramètres!I25","v":0.63},null,null,{"$f":"I52*F52","v":0}]
[{"$f":"Paramètres!B26","v":"Grande collerette (1 m X 1 m)"},null,null,null,{"$f":"Paramètres!F26","v":9},{"$f":"SUMIF(F$7,Questionnaire!AC46,F$47:L$47)","v":0},null,null,{"$f":"Paramètres!I26","v":2},null,null,{"$f":"I53*F53","v":0}]
[{"$f":"Paramètres!B27","v":"Biodisque (60 cm)"},null,null,null,{"$f":"Paramètres!F27","v":5},{"$f":"SUMIF(F$7,Questionnaire!AC47,F$47:L$47)","v":0},null,null,{"$f":"Paramètres!I27","v":2},null,null,{"$f":"I54*F54","v":0}]
[{"$f":"Paramètres!B28","v":"Broches servant à fixer les collerettes"},null,null,null,null,{"$f":"(F52*E52)+(F53*E53)+(F54*E54)","v":0},null,null,{"$f":"Paramètres!I28","v":0.23},null,null,{"$f":"I55*F55","v":0},null,null,"Total",{"$f":"SUM(L51:N55)","v":0}]
[]
["PROTECTEURS ET STUCTURES ARTIFICIELLES FAUNE ET AUX.",null,null,null,null,"Quantité",null,null,"Coût unitaire ($)",null,null,"Coût total ($)"]
["Protecteurs contre mulots",null,null,null,null,{"$f":"IF(OR(Questionnaire!F64,Questionnaire!H64)=TRUE,SUM('Devis d''implantation des écrans'!D43:D44),0)","v":0},null,null,{"$f":"Paramètres!I41","v":1.25},null,null,{"$f":"I58*F58","v":0}]
["Protecteurs contre chevreuils (y compris les deux piquets)",null,null,null,null,{"$f":"IF(Questionnaire!F64=TRUE,SUM('Devis d''implantation des écrans'!D43:D44),0)","v":0},null,null,{"$f":"Paramètres!I42","v":7.5},null,null,{"$f":"I59*F59","v":0}]
["Structures pour la faune et auxiliaires",null,null,null,null,0,null,null,null,null,null,{"$f":"I60*F60","v":0}]
["Structures pour la faune et auxiliaires",null,null,null,null,0,null,null,null,null,null,{"$f":"I61*F61","v":0}]
["Structures pour la faune et auxiliaires",null,null,null,null,0,null,null,null,null,null,{"$f":"I62*F62","v":0},null,null,"TOTAL",{"$f":"SUM(L58:N62)","v":0}]
[]
["MAIN D'ŒUVRE",null,null,null,null,"Temps requis (hres)",null,null,"Taux horaire ($/hre)",null,null,"Coût total ($)"]
["Plantation",null,null,null,null,{"$f":"X33+(AA33*2*B$72/X$26)+(AA33*2*B$72*X$29/I65)","v":0},null,null,{"$f":"Paramètres!$I$29","v":35},null,null,{"$f":"I65*F65","v":0}]
["Pose petites collerettes et broches",null,null,null,null,0,null,null,{"$f":"Paramètres!$I$29","v":35},null,null,{"$f":"I66*F66","v":0}]
["Pose grandes collerettes et broches",null,null,null,null,0,null,null,{"$f":"Paramètres!$I$29","v":35},null,null,0]
["Pose biodisques et broches",null,null,null,null,0,null,null,{"$f":"Paramètres!$I$29","v":35},null,null,0]
["Pose protecteurs à mulots",null,null,null,null,0,null,null,{"$f":"Paramètres!$I$29","v":35},null,null,0]
["Pose protecteurs à chevreuils",null,null,null,null,0,null,null,{"$f":"Paramètres!$I$29","v":35},null,null,0]
["Pose structures pour la faune et auxiliaires",null,null,null,null,0,null,null,{"$f":"Paramètres!$I$29","v":35},null,null,0,null,null,"Total",{"$f":"SUM(L65:N71)","v":0}]
["Distance aller (km):",{"$f":"Questionnaire!H56","v":0}]
[]
["TRAVAIL FORFAITAIRE",null,null,null,null,null,null,null,null,null,null,"Coût total ($)"]
["TRAVAIL DU SOL ET DÉROULAGE DU PLASTIQUE (mettre un \"X\" si  fait par producteur)",null,null,null,null,null,null,null,null,null,null,{"$f":"IF(F51=0,0,IF(K75=\"X\",(F9*X25),(F9*X23)+(B72/80*2*X24)))","v":0}]
["PLANS ET DEVIS",null,null,null,null,null,null,null,null,null,null,{"$f":"Paramètres!I32","v":800},null,null,"Total",{"$f":"IF(P3>0,SUM(L75:N76),0)","v":0},null,null,null,null,null,null,null,null,null,1.7]
[null,null,null,null,null,null,null,null,null,null,null,null,null,null,null,null,null,null,null,null,null,null,null,null,"Max subvention protection cultures ($/m):",2]
[null,null,null,null,null,null,null,null,null,null,null,null,null,null,"SOUS-TOTAL SANS LES VÉGÉTAUX:",{"$f":"P55+P62+P71+P76","v":0},null,null,null,null,null,null,null,null,"Max subvention protection bâtiments ($/m):",7]
[null,null,null,null,null,null,null,null,null,null,null,null,null,null,"COÛT AU MÈTRE SANS VÉGÉTAUX:",{"$f":"IF(P3=0,0,P78/P3)","v":0},null,null,null,null,null,null,null,null,"Max subvention protection bâtiments ($/m):"]
[]
[]
[null,null,null,null,null,null,null,null,null,null,null,null,null,null,"TOTAL AVANT SUBVENTION:",{"$f":"P78+P48","v":0}]
[null,null,null,null,null,null,null,null,null,null,null,null,null,null,"COÛT AU MÈTRE TOTAL AVEC VÉGÉTAUX:",{"$f":"IF(P3=0,0,P82/P3)","v":0}]
[]
[]
[null,null,null,null,null,null,"Pourcentage de remboursement:",{"$f":"Questionnaire!H58","v":0.7},null,null,null,null,null,null," DE REMBOURSEMENT PRIME-VERT OU AUTRE:",{"$f":"IF(Questionnaire!E58=TRUE,IF('Menu simulation'!H8=TRUE,((MIN(Z77*P3,P79*P3)+T48)*H86),((MIN(Z76*P3,P79*P3)+T48)*H86)),P82*H86)","v":0}]
[]
[null,null,null,null,null,null,null,null,null,null,null,null,"TOTAL:",null,null,{"$f":"P82-P86","v":0}]
[null,null,null,null,null,null,null,null,null,null,null,null,null,null,"COÛT AU MÈTRE TOTAL AVEC VÉGÉTAUX:",{"$f":"IF(P3=0,0,P88/P3)","v":0}]
[]
[]
[null,null,null,null,"AVEC ARBRES DE FORT CALIBRE"]
["Mettre un X pour des arbres de fort calibre",null,null,{"$f":"IF(OR(Questionnaire!H60=\"Oui\",Questionnaire!H60=\"Yes\"),\"x\",\" \")","v":" "}]
[]
["Taux de conversion",9,null,null,null,null,null,null,null,null,null,null,null,null,"TOTAL AVANT SUBVENTION POUR DES ARBRES DE FORT CALIBRES:",{"$f":"P82*B95","v":0}]
[null,null,null,null,null,null,null,null,null,null,null,null,null,null,"COÛT AU MÈTRE TOTAL AVEC VÉGÉTAUX DE FORT CALIBRES:",{"$f":"P83*9","v":0}]
[]
[null,null,null,null,null,null,null,null,null,null,null,null,null,null," DE REMBOURSEMENT PRIME-VERT :",{"$f":"MIN(P95*H86,(1.7*P3)+(9*D47))","v":0}]
[]
[null,null,null,null,null,null,null,null,null,null,null,null,"TOTAL:",null,null,{"$f":"P95-P98","v":0}]
[null,null,null,null,null,null,null,null,null,null,null,null,null,null,"COÛT AU MÈTRE TOTAL AVEC VÉGÉTAUX:",{"$f":"IF(P3=0,0,P100/P3)","v":0}]
[]
[]
[]
[]
[]
[]
[]
[]
[]
[]
[]
[]
[]
[]
[]
[]
[]
[]
[]
[]
[]
[]
[]
[]
[]
[]
[]
[]
[]
[]
[]
[]
[]
[]
[]
[]
[]
[]
[]
[]
[]
[]
[]
[]
[]
[]
[]
[]
[]
[]
[]
[]
[]
[]
[]
[]
[]
[]
[]
[]
[]
[]
[]
[]
[]
[]
[]
[]
[]
[]
[]
[]
[]
[]
[]
[]
[]
[]
[]
[]
[]
[]
[]
[]
[]
[]
[]
[]
[]
[]
[]
[]
[]
[]
[]
[]
[]
[]
[]
[]
[]
[]
[]
[]
[]
[]
[]
[]
[]
[]
[]
[]
[]
[]
[]
[]
[]
[]
[]
[]
[]
[]
[]
[]
[]
[]
[]
[]
[]
[]
[]
[]
[]
[]
[]
[]
[]
[]
[]
[]
[]
[]
[]
[]
[]
[]
[]
[]
[]
[]
[]
[]
[]
[]
[]
[]
[]
[]
[]
[]
[]
[]
[]
[]
[]
[]
[]
[]
[]
[]
[]
[]
[]
[]
[]
[]
[]
[]
[]
[]
[]
[]
[]
[]
[]
[]
[]
[]
[]
[]
[]
[]
[]
[]
[]
[]
[]
[]
[]
[]
[]
[]
[]
[]
[]
[]
[]
[]
[]
[]
[]
[]
[]
[]
[]
[]
[]
[]
[]
[]
[]
[]
[]
[]
[]
[]
[]
[]
[]
[]
[]
[]
[]
[]
[]
[]
[]
[]
[]
[]
[]
[]
[]
[]
[]
[]
[]
[]
[]
[]
[]
[]
[]
[]
[]
[]
[]
[]
[]
[]
[]
[]
[]
[]
[]
[]
[]
[]
[]
[]
[]
[]
[]
[]
[]
[]
[]
[]
[]
[]
[]
[]
[]
[]
[]
[]
[]
[]
[]
[]
[]
[]
[]
[]
[]
[]
[]
[]
[]
[]
[]
[]
[]
[]
[]
[]
[]
[]
[]
[]
[]
[]
[]
[]
[]
[]
[]
[]
[]
[]
[]
[]
[]
[]
[]
[]
[]
[]
[]
[]
[]
[]
[]
[]
[]
[]
[]
[]
[]
[]
[]
[]
[]
[]
[]
[]
[]
[]
[]
[]
[]
[]
[]
[]
[]
[]
[]
[]
[]
[]
[]
[]
[]
[]
[]
[]
[]
[]
[]
[]
[]
[]
[]
[]
[]
[]
[]
[]
[]
[]
[]
[]
[]
[]
[]
[]
[]
[]
[]
[]
[]
[]
[]
[]
[]
[]
[]
[]
[]
[]
[]
[]
[]
[]
[]
[]
[]
[]
[]
[]
[]
[]
[]
[]
[]
[]
[]
[]
[]
[]
[]
[]
[]
[]
[]
[]
[]
[]
[]
[]
[]
[]
[]
[]
[]
[]
[]
[]
[]
[]
[]
[]
[]
[]
[]
[]
[]
[]
[]
[]
[]
[]
[]
[]
[]
[]
[]
[]
[]
[]
[]
[]
[]
[]
[]
[]
[]
[]
[]
[]
[]
[]
[]
[]
[]
[]
[]
[]
[]
[]
[]
[]
[]
[]
[]
[]
[]
[]
[]
[]
[]
[]
[]
[]
[]
[]
[]
[]
[]
[]
[]
[]
[]
[]
[]
[]
[]
[]
[]
[]
[]
[]
[]
[]
[]
[]
[]
[]
[]
[]
[]
[]
[]
[]
[]
[]
[]
[]
[]
[]
[]
[]
[]
[]
[]
[]
[]
[]
[]
[]
[]
[]
[]
[]
[]
[]
[]
[]
[]
[]
[]
[]
[]
[]
[]
[]
[]
[]
[]
[]
[]
[]
[]
[]
[]
[]
[]
[]
[]
[]
[]
[]
[]
[]
[]
[]
[]
[]
[]
[]
[]
[]
[]
[]
[]
[]
[]
[]
[]
[]
[]
[]
[]
[]
[]
[]
[]
[]
[]
[]
[]
[]
[]
[]
[]
[]
[]
[]
[]
[]
[]
[]
[]
[]
[]
[]
[]
[]
[]
[]
[]
[]
[]
[]
[]
[]
[]
[]
[]
[]
[]
[]
[]
[]
[]
[]
[]
[]
[]
[]
[]
[]
[]
[]
[]
[]
[]
[]
[]
[]
[]
[]
[]
[]
[]
[]
[]
[]
[]
[]
[]
[]
[]
[]
[]
[]
[]
[]
[]
[]
[]
[]
[]
[]
[]
[]
[]
[]
[]
[]
[]
[]
[]
[]
[]
[]
[]
[]
[]
[]
[]
[]
[]
[]
[]
[]
[]
[]
[]
[]
[]
[]
[]
[]
[]
[]
[]
[]
[]
[]
[]
[]
[]
[]
[]
[]
[]
[]
[]
[null,null,null,null,null,null,null,null,null,null,null,null,null,null,null,null,null,null,"Vérifier le prix des plançons de 3m"]

{"sheet":"Coûts d'implantation","index":15,"n_rows":139,"n_cols":9,"rows_kept":139,"cut":false,"hidden":false,"merged":[[15,7,16,8],[17,1,17,2],[17,3,17,4],[17,5,17,6],[17,7,17,8],[0,0,0,9],[3,1,5,1],[3,6,5,6],[3,8,5,8],[3,2,5,3],[3,4,5,5],[3,7,5,7],[6,4,6,5],[7,2,7,3],[7,4,7,5],[8,2,8,3],[8,4,8,5],[6,2,6,3],[9,2,9,3],[9,4,9,5],[10,2,10,3],[10,4,10,5],[13,2,13,3],[13,4,13,5],[11,2,11,3],[11,4,11,5],[12,2,12,3],[98,0,98,1],[98,4,98,5],[12,4,12,5],[15,1,16,2],[15,3,16,4],[15,5,16,6],[96,6,97,6],[96,0,97,2],[96,4,97,5],[19,4,19,5]]}
[]
["ok"]
[]
[null,"Période","Améliorations",null,"Détériorations",null,"Marge","Marge actualisée ","Marge actualisée accumulée"]
[]
[]
[null,"0-5 ans",0,null,{"$f":"C104","v":0},null,{"$f":"C7+E7","v":0},{"$f":"F104","v":0},{"$f":"F104","v":0}]
[]
[null,"5-10 ans",0,null,{"$f":"C109","v":0},null,{"$f":"C9+E9","v":0},{"$f":"F109","v":0},{"$f":"G109","v":0}]
[]
[null,"10-20 ans",0,null,{"$f":"C119","v":0},null,{"$f":"C11+E11","v":0},{"$f":"F119","v":0},{"$f":"G119","v":0}]
[]
[null,"20-40 ans",0,null,{"$f":"C139","v":0},null,{"$f":"C13+E13","v":0},{"$f":"F139","v":0},{"$f":"G139","v":0}]
[]
[]
[null,"Coûts liés à l'implantation de 0 à 5 ans",null,"Coûts liés à l'implantation de 5 à 10 ans",null,"Coûts liés à l'implantation de 10 à 20 ans",null,"Coûts liés à l'implantation de 20 à 40 ans"]
[]
[null,{"$f":"IF('Devis d''implantation des écrans'!D93=\"X\",'Devis d''implantation des écrans'!P100,'Devis d''implantation des écrans'!P88)","v":0},null,0,null,0,null,0]
[]
[null,null,null,null,"DEVIS D'IMPLANTATION"]
[]
[]
[]
[]
[]
[]
[]
[]
[]
[]
[]
[]
[]
[]
[]
[]
[]
[]
[]
[]
[]
[]
[]
[]
[]
[]
[]
[]
[]
[]
[]
[]
[]
[]
[]
[]
[]
[]
[]
[]
[]
[]
[]
[]
[]
[]
[]
[]
[]
[]
[]
[]
[]
[]
[]
[]
[]
[]
[]
[]
[]
[]
[]
[]
[]
[]
[]
[]
[]
[]
[]
[]
[]
[]
[]
[]
["Détériorations",null,null,null,"Marge actualisée",null,"Marge actualisée accumulée"]
[]
["total cumulatif à l'an"]
[1,{"$f":"-1*$B$18","v":0},null,null,{"$f":"B100/POWER(1+Paramètres!$AF$14,A100)","v":0}]
[2,{"$f":"0*$B$18","v":0},null,null,{"$f":"B101/POWER(1+Paramètres!$AF$14,A101)","v":0}]
[3,{"$f":"0*$B$18","v":0},null,null,{"$f":"B102/POWER(1+Paramètres!$AF$14,A102)","v":0}]
[4,0,null,null,{"$f":"B103/POWER(1+Paramètres!$AF$14,A103)","v":0}]
[5,0,{"$f":"SUM(B100:B104)","v":0},null,{"$f":"B104/POWER(1+Paramètres!$AF$14,A104)","v":0},{"$f":"SUM(E100:E104)","v":0}]
[6,0,null,null,{"$f":"B105/POWER(1+Paramètres!$AF$14,A105)","v":0}]
[7,0,null,null,{"$f":"B106/POWER(1+Paramètres!$AF$14,A106)","v":0}]
[8,0,null,null,{"$f":"B107/POWER(1+Paramètres!$AF$14,A107)","v":0}]
[9,0,null,null,{"$f":"B108/POWER(1+Paramètres!$AF$14,A108)","v":0}]
[10,0,{"$f":"SUM(B105:B109)","v":0},null,{"$f":"B109/POWER(1+Paramètres!$AF$14,A109)","v":0},{"$f":"SUM(E105:E109)","v":0},{"$f":"SUM(E100:E109)","v":0}]
[11,0,null,null,{"$f":"B110/POWER(1+Paramètres!$AF$14,A110)","v":0}]
[12,0,null,null,{"$f":"B111/POWER(1+Paramètres!$AF$14,A111)","v":0}]
[13,0,null,null,{"$f":"B112/POWER(1+Paramètres!$AF$14,A112)","v":0}]
[14,0,null,null,{"$f":"B113/POWER(1+Paramètres!$AF$14,A113)","v":0}]
[15,0,null,null,{"$f":"B114/POWER(1+Paramètres!$AF$14,A114)","v":0}]
[16,0,null,null,{"$f":"B115/POWER(1+Paramètres!$AF$14,A115)","v":0}]
[17,0,null,null,{"$f":"B116/POWER(1+Paramètres!$AF$14,A116)","v":0}]
[18,0,null,null,{"$f":"B117/POWER(1+Paramètres!$AF$14,A117)","v":0}]
[19,0,null,null,{"$f":"B118/POWER(1+Paramètres!$AF$14,A118)","v":0}]
[20,0,{"$f":"SUM(B110:B119)","v":0},null,{"$f":"B119/POWER(1+Paramètres!$AF$14,A119)","v":0},{"$f":"SUM(E110:E119)","v":0},{"$f":"SUM(E100:E119)","v":0}]
[21,0,null,null,{"$f":"B120/POWER(1+Paramètres!$AF$14,A120)","v":0}]
[22,0,null,null,{"$f":"B121/POWER(1+Paramètres!$AF$14,A121)","v":0}]
[23,0,null,null,{"$f":"B122/POWER(1+Paramètres!$AF$14,A122)","v":0}]
[24,0,null,null,{"$f":"B123/POWER(1+Paramètres!$AF$14,A123)","v":0}]
[25,0,null,null,{"$f":"B124/POWER(1+Paramètres!$AF$14,A124)","v":0}]
[26,0,null,null,{"$f":"B125/POWER(1+Paramètres!$AF$14,A125)","v":0}]
[27,0,null,null,{"$f":"B126/POWER(1+Paramètres!$AF$14,A126)","v":0}]
[28,0,null,null,{"$f":"B127/POWER(1+Paramètres!$AF$14,A127)","v":0}]
[29,0,null,null,{"$f":"B128/POWER(1+Paramètres!$AF$14,A128)","v":0}]
[30,0,null,null,{"$f":"B129/POWER(1+Paramètres!$AF$14,A129)","v":0}]
[31,0,null,null,{"$f":"B130/POWER(1+Paramètres!$AF$14,A130)","v":0}]
[32,0,null,null,{"$f":"B131/POWER(1+Paramètres!$AF$14,A131)","v":0}]
[33,0,null,null,{"$f":"B132/POWER(1+Paramètres!$AF$14,A132)","v":0}]
[34,0,null,null,{"$f":"B133/POWER(1+Paramètres!$AF$14,A133)","v":0}]
[35,0,null,null,{"$f":"B134/POWER(1+Paramètres!$AF$14,A134)","v":0}]
[36,0,null,null,{"$f":"B135/POWER(1+Paramètres!$AF$14,A135)","v":0}]
[37,0,null,null,{"$f":"B136/POWER(1+Paramètres!$AF$14,A136)","v":0}]
[38,0,null,null,{"$f":"B137/POWER(1+Paramètres!$AF$14,A137)","v":0}]
[39,0,null,null,{"$f":"B138/POWER(1+Paramètres!$AF$14,A138)","v":0}]
[40,0,{"$f":"SUM(B120:B139)","v":0},null,{"$f":"B139/POWER(1+Paramètres!$AF$14,A139)","v":0},{"$f":"SUM(E120:E139)","v":0},{"$f":"SUM(E100:E139)","v":0}]

{"sheet":"Calcul espace cultivable","index":16,"n_rows":153,"n_cols":30,"rows_kept":153,"cut":false,"hidden":false,"merged":[[74,8,74,9],[73,6,73,7],[64,2,64,3],[68,2,68,3],[68,4,68,5],[62,4,62,5],[67,4,67,5],[63,2,63,3],[65,2,65,3],[69,6,69,7],[66,2,66,3],[64,6,64,7],[62,2,62,3],[39,0,39,1],[15,1,16,2],[58,4,59,5],[43,0,43,1],[43,2,43,8],[58,6,59,7],[41,0,42,1],[58,8,59,9],[50,0,50,1],[15,7,16,8],[17,1,17,2],[17,3,17,4],[17,5,17,6],[17,7,17,8],[44,0,44,1],[102,6,102,7],[102,4,102,5],[101,6,101,7],[96,4,96,5],[101,4,101,5],[97,4,97,5],[65,6,65,7],[40,0,40,1],[60,4,60,5],[61,4,61,5],[60,6,60,7],[63,6,63,7],[62,6,62,7],[66,4,66,5],[64,4,64,5],[77,6,77,7],[78,6,78,7],[79,6,79,7],[71,6,71,7],[72,6,72,7],[70,6,70,7],[76,6,76,7],[75,6,75,7],[61,6,61,7],[83,0,83,1],[86,2,86,3],[49,0,49,1],[58,2,59,3],[60,2,60,3],[67,2,67,3],[110,0,111,2],[92,0,92,1],[90,2,90,3],[91,2,91,3],[101,2,101,3],[93,2,93,3],[104,0,104,1],[95,2,95,3],[101,0,101,1],[95,0,95,1],[103,0,103,1],[103,2,103,3],[102,0,102,1],[102,2,102,3],[96,0,96,1],[97,0,97,1],[61,2,61,3],[97,2,97,3],[99,0,99,1],[96,2,96,3],[106,0,106,1],[106,2,106,3],[105,0,105,1],[112,0,112,1],[110,4,111,5],[112,4,112,5],[105,2,105,3],[105,4,105,5],[104,2,104,3],[104,4,104,5],[103,4,103,5],[95,4,95,5],[91,4,91,5],[87,6,87,7],[88,0,88,1],[87,2,87,3],[88,2,88,3],[93,6,93,7],[93,0,93,1],[92,2,92,3],[91,6,91,7],[94,0,94,1],[94,2,94,3],[93,4,93,5],[94,4,94,5],[92,4,92,5],[94,8,94,9],[92,8,92,9],[86,4,86,5],[87,4,87,5],[88,4,88,5],[89,4,89,5],[85,0,85,1],[85,2,85,3],[87,0,87,1],[85,4,85,5],[90,4,90,5],[89,2,89,3],[92,6,92,7],[85,6,85,7],[87,8,87,9],[90,6,90,7],[91,8,91,9],[86,0,86,1],[0,0,0,9],[3,1,5,1],[3,6,5,6],[3,7,5,7],[3,8,5,8],[3,2,5,3],[3,4,5,5],[37,0,37,1],[38,0,38,1],[6,4,6,5],[7,2,7,3],[6,2,6,3],[7,4,7,5],[8,2,8,3],[8,4,8,5],[9,4,9,5],[9,2,9,3],[10,2,10,3],[10,4,10,5],[11,2,11,3],[15,5,16,6],[34,0,34,1],[35,0,35,1],[36,0,36,1],[11,4,11,5],[13,4,13,5],[12,2,12,3],[12,4,12,5],[13,2,13,3],[68,8,68,9],[71,8,71,9],[72,8,72,9],[86,6,86,7],[74,6,74,7],[75,8,75,9],[76,8,76,9],[86,8,86,9],[77,8,77,9],[79,8,79,9],[78,8,78,9],[62,8,62,9],[85,8,85,9],[15,3,16,4],[60,8,60,9],[61,8,61,9],[66,6,66,7],[68,6,68,7],[73,8,73,9],[106,8,106,9],[105,6,105,7],[105,8,105,9],[103,8,103,9],[102,8,102,9],[90,8,90,9],[88,6,88,7],[69,8,69,9],[70,8,70,9],[88,8,88,9],[104,8,104,9],[95,6,95,7],[96,6,96,7],[97,6,97,7],[95,8,95,9],[97,8,97,9],[96,8,96,9],[89,8,89,9],[89,6,89,7],[93,8,93,9],[103,6,103,7],[104,6,104,7],[101,8,101,9],[94,6,94,7],[27,12,27,13],[43,9,43,15],[43,16,43,22],[43,23,43,29],[110,6,111,6],[45,0,46,1],[47,0,48,1],[67,6,67,7],[107,0,107,1],[107,2,107,3],[67,8,67,9],[63,8,63,9],[64,8,64,9],[65,8,65,9],[66,8,66,9],[63,4,63,5],[65,4,65,5],[107,4,107,5],[107,6,107,7],[106,4,106,5],[106,6,106,7],[107,8,107,9],[80,6,81,7],[80,8,81,9]]}
[]
[]
[]
[null,"Période","Améliorations",null,"Détériorations",null,"Marge","Marge actualisée ","Marge actualisée accumulée"]
[]
[]
[null,"0-5 ans",0,null,{"$f":"C118","v":0},null,{"$f":"C7+E7","v":0},{"$f":"F118","v":0},{"$f":"F118","v":0}]
[]
[null,"5-10 ans",0,null,{"$f":"C123","v":0},null,{"$f":"C9+E9","v":0},{"$f":"F123","v":0},{"$f":"G123","v":0}]
[]
[null,"10-20 ans",0,null,{"$f":"C133","v":0},null,{"$f":"C11+E11","v":0},{"$f":"F133","v":0},{"$f":"G133","v":0}]
[]
[null,"20-40 ans",0,null,{"$f":"C153","v":0},null,{"$f":"C13+E13","v":0},{"$f":"F153","v":0},{"$f":"G153","v":0}]
[]
[]
[null,"Pertes liées à l'espace cultivable de 0 à 5 ans",null,"Pertes liées à l'espace cultivable de 5 à 10 ans",null,"Pertes liées à l'espace cultivable de 10 à 20 ans",null,"Pertes liées à l'espace cultivable de 20 à 40 ans"]
[]
[null,{"$f":"C108","v":0},null,{"$f":"E108","v":0},null,{"$f":"G108","v":0},null,{"$f":"I108","v":0}]
[]
[]
[]
[]
[]
[]
[]
[]
[]
[null,null,null,null,null,null,null,null,null,null,"Haie",null,"Bande riveraine"]
[null,null,null,null,null,null,null,null,null,"Largeur d'une rangée","Non entretenu (FNO)","Entretenu (FNO) ou Non entretenu (ARB-SAH)","Bande riveraine non entretenue","Bande riveraine entretenue"]
[null,null,null,null,null,null,null,null,null,"5 ans",2,2,{"$f":"K30/2","v":1},1]
[null,null,null,null,null,null,null,null,null,"10 ans",4,3,2,1.5]
[null,null,null,null,null,null,null,null,null,"20 ans",5,3,2.5,1.5]
[null,null,null,null,null,null,null,null,null,"40 ans",8,3,4,1.5]
[]
["Rangée 1",null,"CON",{"$f":"IF('Devis d''implantation des écrans'!F$42>0,TRUE,FALSE)","v":false},null,"Nombre de rangées",null,{"$f":"Questionnaire!E18","v":0}]
["Rangée 2",null,"CON",{"$f":"IF('Devis d''implantation des écrans'!G$42>0,TRUE,FALSE)","v":false},null,"Longueur de la haie",null,{"$f":"Questionnaire!E16","v":0}]
["Rangée 3",null,"CON",{"$f":"IF('Devis d''implantation des écrans'!H$42>0,TRUE,FALSE)","v":false}]
["Rangée 4",null,"CON",{"$f":"IF('Devis d''implantation des écrans'!I$42>0,TRUE,FALSE)","v":false}]
["Rangée 5",null,"CON",{"$f":"IF('Devis d''implantation des écrans'!J$42>0,TRUE,FALSE)","v":false}]
["Rangée 6",null,"CON",{"$f":"IF('Devis d''implantation des écrans'!K$42>0,TRUE,FALSE)","v":false}]
["Rangée 7",null,"CON",{"$f":"IF('Devis d''implantation des écrans'!L$42>0,TRUE,FALSE)","v":false}]
["Largeur récupéré pour la culture pour bande riveraine",null,1.5]
[null,null,null,null,null,null,null,null,null,null,null,"Quoi faire avec les PEH"]
[null,null,"Largeur en m à 5 ans",null,null,null,null,null,null,"Largeur en m à 10 ans",null,null,null,null,null,null,"Largeur en m  à 20ans",null,null,null,null,null,null,"Largeur en m  à 40ans"]
["Nb de rangée",null,1,2,3,4,5,6,7,1,2,3,4,5,6,7,1,2,3,4,5,6,7,1,2,3,4,5,6,7]
["Non entretenu",null,{"$f":"AND(OR(Questionnaire!$G$76=\"Non\",Questionnaire!$G$76=\"No\"),OR('Devis d''implantation des écrans'!$D44>0,'Devis d''implantation des écrans'!$D42>0),Questionnaire!$E$18=C45)","v":false},{"$f":"AND(OR(Questionnaire!$G$76=\"Non\",Questionnaire!$G$76=\"No\"),OR('Devis d''implantation des écrans'!$D44>0,'Devis d''implantation des écrans'!$D42>0),Questionnaire!$E$18=D45)","v":false},{"$f":"AND(OR(Questionnaire!$G$76=\"Non\",Questionnaire!$G$76=\"No\"),OR('Devis d''implantation des écrans'!$D44>0,'Devis d''implantation des écrans'!$D42>0),Questionnaire!$E$18=E45)","v":false},{"$f":"AND(OR(Questionnaire!$G$76=\"Non\",Questionnaire!$G$76=\"No\"),OR('Devis d''implantation des écrans'!$D44>0,'Devis d''implantation des écrans'!$D42>0),Questionnaire!$E$18=F45)","v":false},{"$f":"AND(OR(Questionnaire!$G$76=\"Non\",Questionnaire!$G$76=\"No\"),OR('Devis d''implantation des écrans'!$D44>0,'Devis d''implantation des écrans'!$D42>0),Questionnaire!$E$18=G45)","v":false},{"$f":"AND(OR(Questionnaire!$G$76=\"Non\",Questionnaire!$G$76=\"No\"),OR('Devis d''implantation des écrans'!$D44>0,'Devis d''implantation des écrans'!$D42>0),Questionnaire!$E$18=H45)","v":false},{"$f":"AND(OR(Questionnaire!$G$76=\"Non\",Questionnaire!$G$76=\"No\"),OR('Devis d''implantation des écrans'!$D44>0,'Devis d''implantation des écrans'!$D42>0),Questionnaire!$E$18=I45)","v":false},{"$f":"AND(OR(Questionnaire!$G$76=\"Non\",Questionnaire!$G$76=\"No\"),OR('Devis d''implantation des écrans'!$D44>0,'Devis d''implantation des écrans'!$D42>0),Questionnaire!$E$18=J45)","v":false},{"$f":"AND(OR(Questionnaire!$G$76=\"Non\",Questionnaire!$G$76=\"No\"),OR('Devis d''implantation des écrans'!$D44>0,'Devis d''implantation des écrans'!$D42>0),Questionnaire!$E$18=K45)","v":false},{"$f":"AND(OR(Questionnaire!$G$76=\"Non\",Questionnaire!$G$76=\"No\"),OR('Devis d''implantation des écrans'!$D44>0,'Devis d''implantation des écrans'!$D42>0),Questionnaire!$E$18=L45)","v":false},{"$f":"AND(OR(Questionnaire!$G$76=\"Non\",Questionnaire!$G$76=\"No\"),OR('Devis d''implantation des écrans'!$D44>0,'Devis d''implantation des écrans'!$D42>0),Questionnaire!$E$18=M45)","v":false},{"$f":"AND(OR(Questionnaire!$G$76=\"Non\",Questionnaire!$G$76=\"No\"),OR('Devis d''implantation des écrans'!$D44>0,'Devis d''implantation des écrans'!$D42>0),Questionnaire!$E$18=N45)","v":false},{"$f":"AND(OR(Questionnaire!$G$76=\"Non\",Questionnaire!$G$76=\"No\"),OR('Devis d''implantation des écrans'!$D44>0,'Devis d''implantation des écrans'!$D42>0),Questionnaire!$E$18=O45)","v":false},{"$f":"AND(OR(Questionnaire!$G$76=\"Non\",Questionnaire!$G$76=\"No\"),OR('Devis d''implantation des écrans'!$D44>0,'Devis d''implantation des écrans'!$D42>0),Questionnaire!$E$18=P45)","v":false},{"$f":"AND(OR(Questionnaire!$G$76=\"Non\",Questionnaire!$G$76=\"No\"),OR('Devis d''implantation des écrans'!$D44>0,'Devis d''implantation des écrans'!$D42>0),Questionnaire!$E$18=Q45)","v":false},{"$f":"AND(OR(Questionnaire!$G$76=\"Non\",Questionnaire!$G$76=\"No\"),OR('Devis d''implantation des écrans'!$D44>0,'Devis d''implantation des écrans'!$D42>0),Questionnaire!$E$18=R45)","v":false},{"$f":"AND(OR(Questionnaire!$G$76=\"Non\",Questionnaire!$G$76=\"No\"),OR('Devis d''implantation des écrans'!$D44>0,'Devis d''implantation des écrans'!$D42>0),Questionnaire!$E$18=S45)","v":false},{"$f":"AND(OR(Questionnaire!$G$76=\"Non\",Questionnaire!$G$76=\"No\"),OR('Devis d''implantation des écrans'!$D44>0,'Devis d''implantation des écrans'!$D42>0),Questionnaire!$E$18=T45)","v":false},{"$f":"AND(OR(Questionnaire!$G$76=\"Non\",Questionnaire!$G$76=\"No\"),OR('Devis d''implantation des écrans'!$D44>0,'Devis d''implantation des écrans'!$D42>0),Questionnaire!$E$18=U45)","v":false},{"$f":"AND(OR(Questionnaire!$G$76=\"Non\",Questionnaire!$G$76=\"No\"),OR('Devis d''implantation des écrans'!$D44>0,'Devis d''implantation des écrans'!$D42>0),Questionnaire!$E$18=V45)","v":false},{"$f":"AND(OR(Questionnaire!$G$76=\"Non\",Questionnaire!$G$76=\"No\"),OR('Devis d''implantation des écrans'!$D44>0,'Devis d''implantation des écrans'!$D42>0),Questionnaire!$E$18=W45)","v":false},{"$f":"AND(OR(Questionnaire!$G$76=\"Non\",Questionnaire!$G$76=\"No\"),OR('Devis d''implantation des écrans'!$D44>0,'Devis d''implantation des écrans'!$D42>0),Questionnaire!$E$18=X45)","v":false},{"$f":"AND(OR(Questionnaire!$G$76=\"Non\",Questionnaire!$G$76=\"No\"),OR('Devis d''implantation des écrans'!$D44>0,'Devis d''implantation des écrans'!$D42>0),Questionnaire!$E$18=Y45)","v":false},{"$f":"AND(OR(Questionnaire!$G$76=\"Non\",Questionnaire!$G$76=\"No\"),OR('Devis d''implantation des écrans'!$D44>0,'Devis d''implantation des écrans'!$D42>0),Questionnaire!$E$18=Z45)","v":false},{"$f":"AND(OR(Questionnaire!$G$76=\"Non\",Questionnaire!$G$76=\"No\"),OR('Devis d''implantation des écrans'!$D44>0,'Devis d''implantation des écrans'!$D42>0),Questionnaire!$E$18=AA45)","v":false},{"$f":"AND(OR(Questionnaire!$G$76=\"Non\",Questionnaire!$G$76=\"No\"),OR('Devis d''implantation des écrans'!$D44>0,'Devis d''implantation des écrans'!$D42>0),Questionnaire!$E$18=AB45)","v":false},{"$f":"AND(OR(Questionnaire!$G$76=\"Non\",Questionnaire!$G$76=\"No\"),OR('Devis d''implantation des écrans'!$D44>0,'Devis d''implantation des écrans'!$D42>0),Questionnaire!$E$18=AC45)","v":false},{"$f":"AND(OR(Questionnaire!$G$76=\"Non\",Questionnaire!$G$76=\"No\"),OR('Devis d''implantation des écrans'!$D44>0,'Devis d''implantation des écrans'!$D42>0),Questionnaire!$E$18=AD45)","v":false}]
[null,null,{"$f":"IF(C46=TRUE,K30,0)","v":0},{"$f":"IF(D46=TRUE,K30+(1*+Questionnaire!$E$20),0)","v":0},{"$f":"IF(E46=TRUE,K30+(2*+Questionnaire!$E$20),0)","v":0},{"$f":"IF(F46=TRUE,K30+(3*+Questionnaire!$E$20),0)","v":0},{"$f":"IF(G46=TRUE,K30+(4*+Questionnaire!$E$20),0)","v":0},{"$f":"IF(H46=TRUE,K30+(5*+Questionnaire!$E$20),0)","v":0},{"$f":"IF(I46=TRUE,K30+(6*+Questionnaire!$E$20),0)","v":0},{"$f":"IF(J46=TRUE,K31,0)","v":0},{"$f":"IF(K46=TRUE,K31+(1*Questionnaire!$E$20),0)","v":0},{"$f":"IF(L46=TRUE,K31+(2*Questionnaire!$E$20),0)","v":0},{"$f":"IF(M46=TRUE,K31+(3*Questionnaire!$E$20),0)","v":0},{"$f":"IF(N46=TRUE,K31+(4*Questionnaire!$E$20),0)","v":0},{"$f":"IF(O46=TRUE,K31+(5*Questionnaire!$E$20),0)","v":0},{"$f":"IF(P46=TRUE,K31+(6*Questionnaire!$E$20),0)","v":0},{"$f":"IF(Q46=TRUE,K32,0)","v":0},{"$f":"IF(R46=TRUE,K32+(1*Questionnaire!$E$20),0)","v":0},{"$f":"IF(S46=TRUE,K32+(2*Questionnaire!$E$20),0)","v":0},{"$f":"IF(T46=TRUE,K32+(3*Questionnaire!$E$20),0)","v":0},{"$f":"IF(U46=TRUE,K32+(4*Questionnaire!$E$20),0)","v":0},{"$f":"IF(V46=TRUE,K32+(5*Questionnaire!$E$20),0)","v":0},{"$f":"IF(W46=TRUE,K32+(6*Questionnaire!$E$20),0)","v":0},{"$f":"IF(X46=TRUE,K33,0)","v":0},{"$f":"IF(Y46=TRUE,K33+(1*Questionnaire!$E$20),0)","v":0},{"$f":"IF(Z46=TRUE,K33+(2*Questionnaire!$E$20),0)","v":0},{"$f":"IF(AA46=TRUE,K33+(3*Questionnaire!$E$20),0)","v":0},{"$f":"IF(AB46=TRUE,K33+(4*Questionnaire!$E$20),0)","v":0},{"$f":"IF(AC46=TRUE,K33+(5*Questionnaire!$E$20),0)","v":0},{"$f":"IF(AD46=TRUE,K33+(6*Questionnaire!$E$20),0)","v":0}]
["Entretenu (FNO) ou Non entretenu (ARB-SAH)",null,{"$f":"AND(OR(OR(Questionnaire!$G$76=\"Oui\",Questionnaire!$G$76=\"Yes\"),'Devis d''implantation des écrans'!$D45>0,'Devis d''implantation des écrans'!$D46>0),Questionnaire!$E$18=C45)","v":false},{"$f":"AND(OR(OR(Questionnaire!$G$76=\"Oui\",Questionnaire!$G$76=\"Yes\"),'Devis d''implantation des écrans'!$D45>0,'Devis d''implantation des écrans'!$D46>0),Questionnaire!$E$18=D45)","v":false},{"$f":"AND(OR(OR(Questionnaire!$G$76=\"Oui\",Questionnaire!$G$76=\"Yes\"),'Devis d''implantation des écrans'!$D45>0,'Devis d''implantation des écrans'!$D46>0),Questionnaire!$E$18=E45)","v":false},{"$f":"AND(OR(OR(Questionnaire!$G$76=\"Oui\",Questionnaire!$G$76=\"Yes\"),'Devis d''implantation des écrans'!$D45>0,'Devis d''implantation des écrans'!$D46>0),Questionnaire!$E$18=F45)","v":false},{"$f":"AND(OR(OR(Questionnaire!$G$76=\"Oui\",Questionnaire!$G$76=\"Yes\"),'Devis d''implantation des écrans'!$D45>0,'Devis d''implantation des écrans'!$D46>0),Questionnaire!$E$18=G45)","v":false},{"$f":"AND(OR(OR(Questionnaire!$G$76=\"Oui\",Questionnaire!$G$76=\"Yes\"),'Devis d''implantation des écrans'!$D45>0,'Devis d''implantation des écrans'!$D46>0),Questionnaire!$E$18=H45)","v":false},{"$f":"AND(OR(OR(Questionnaire!$G$76=\"Oui\",Questionnaire!$G$76=\"Yes\"),'Devis d''implantation des écrans'!$D45>0,'Devis d''implantation des écrans'!$D46>0),Questionnaire!$E$18=I45)","v":false},{"$f":"AND(OR(OR(Questionnaire!$G$76=\"Oui\",Questionnaire!$G$76=\"Yes\"),'Devis d''implantation des écrans'!$D45>0,'Devis d''implantation des écrans'!$D46>0),Questionnaire!$E$18=J45)","v":false},{"$f":"AND(OR(OR(Questionnaire!$G$76=\"Oui\",Questionnaire!$G$76=\"Yes\"),'Devis d''implantation des écrans'!$D45>0,'Devis d''implantation des écrans'!$D46>0),Questionnaire!$E$18=K45)","v":false},{"$f":"AND(OR(OR(Questionnaire!$G$76=\"Oui\",Questionnaire!$G$76=\"Yes\"),'Devis d''implantation des écrans'!$D45>0,'Devis d''implantation des écrans'!$D46>0),Questionnaire!$E$18=L45)","v":false},{"$f":"AND(OR(OR(Questionnaire!$G$76=\"Oui\",Questionnaire!$G$76=\"Yes\"),'Devis d''implantation des écrans'!$D45>0,'Devis d''implantation des écrans'!$D46>0),Questionnaire!$E$18=M45)","v":false},{"$f":"AND(OR(OR(Questionnaire!$G$76=\"Oui\",Questionnaire!$G$76=\"Yes\"),'Devis d''implantation des écrans'!$D45>0,'Devis d''implantation des écrans'!$D46>0),Questionnaire!$E$18=N45)","v":false},{"$f":"AND(OR(OR(Questionnaire!$G$76=\"Oui\",Questionnaire!$G$76=\"Yes\"),'Devis d''implantation des écrans'!$D45>0,'Devis d''implantation des écrans'!$D46>0),Questionnaire!$E$18=O45)","v":false},{"$f":"AND(OR(OR(Questionnaire!$G$76=\"Oui\",Questionnaire!$G$76=\"Yes\"),'Devis d''implantation des écrans'!$D45>0,'Devis d''implantation des écrans'!$D46>0),Questionnaire!$E$18=P45)","v":false},{"$f":"AND(OR(OR(Questionnaire!$G$76=\"Oui\",Questionnaire!$G$76=\"Yes\"),'Devis d''implantation des écrans'!$D45>0,'Devis d''implantation des écrans'!$D46>0),Questionnaire!$E$18=Q45)","v":false},{"$f":"AND(OR(OR(Questionnaire!$G$76=\"Oui\",Questionnaire!$G$76=\"Yes\"),'Devis d''implantation des écrans'!$D45>0,'Devis d''implantation des écrans'!$D46>0),Questionnaire!$E$18=R45)","v":false},{"$f":"AND(OR(OR(Questionnaire!$G$76=\"Oui\",Questionnaire!$G$76=\"Yes\"),'Devis d''implantation des écrans'!$D45>0,'Devis d''implantation des écrans'!$D46>0),Questionnaire!$E$18=S45)","v":false},{"$f":"AND(OR(OR(Questionnaire!$G$76=\"Oui\",Questionnaire!$G$76=\"Yes\"),'Devis d''implantation des écrans'!$D45>0,'Devis d''implantation des écrans'!$D46>0),Questionnaire!$E$18=T45)","v":false},{"$f":"AND(OR(OR(Questionnaire!$G$76=\"Oui\",Questionnaire!$G$76=\"Yes\"),'Devis d''implantation des écrans'!$D45>0,'Devis d''implantation des écrans'!$D46>0),Questionnaire!$E$18=U45)","v":false},{"$f":"AND(OR(OR(Questionnaire!$G$76=\"Oui\",Questionnaire!$G$76=\"Yes\"),'Devis d''implantation des écrans'!$D45>0,'Devis d''implantation des écrans'!$D46>0),Questionnaire!$E$18=V45)","v":false},{"$f":"AND(OR(OR(Questionnaire!$G$76=\"Oui\",Questionnaire!$G$76=\"Yes\"),'Devis d''implantation des écrans'!$D45>0,'Devis d''implantation des écrans'!$D46>0),Questionnaire!$E$18=W45)","v":false},{"$f":"AND(OR(OR(Questionnaire!$G$76=\"Oui\",Questionnaire!$G$76=\"Yes\"),'Devis d''implantation des écrans'!$D45>0,'Devis d''implantation des écrans'!$D46>0),Questionnaire!$E$18=X45)","v":false},{"$f":"AND(OR(OR(Questionnaire!$G$76=\"Oui\",Questionnaire!$G$76=\"Yes\"),'Devis d''implantation des écrans'!$D45>0,'Devis d''implantation des écrans'!$D46>0),Questionnaire!$E$18=Y45)","v":false},{"$f":"AND(OR(OR(Questionnaire!$G$76=\"Oui\",Questionnaire!$G$76=\"Yes\"),'Devis d''implantation des écrans'!$D45>0,'Devis d''implantation des écrans'!$D46>0),Questionnaire!$E$18=Z45)","v":false},{"$f":"AND(OR(OR(Questionnaire!$G$76=\"Oui\",Questionnaire!$G$76=\"Yes\"),'Devis d''implantation des écrans'!$D45>0,'Devis d''implantation des écrans'!$D46>0),Questionnaire!$E$18=AA45)","v":false},{"$f":"AND(OR(OR(Questionnaire!$G$76=\"Oui\",Questionnaire!$G$76=\"Yes\"),'Devis d''implantation des écrans'!$D45>0,'Devis d''implantation des écrans'!$D46>0),Questionnaire!$E$18=AB45)","v":false},{"$f":"AND(OR(OR(Questionnaire!$G$76=\"Oui\",Questionnaire!$G$76=\"Yes\"),'Devis d''implantation des écrans'!$D45>0,'Devis d''implantation des écrans'!$D46>0),Questionnaire!$E$18=AC45)","v":false},{"$f":"AND(OR(OR(Questionnaire!$G$76=\"Oui\",Questionnaire!$G$76=\"Yes\"),'Devis d''implantation des écrans'!$D45>0,'Devis d''implantation des écrans'!$D46>0),Questionnaire!$E$18=AD45)","v":false}]
[null,null,{"$f":"IF(C48=TRUE,L30,0)","v":0},{"$f":"IF(D48=TRUE,L30+(1*Questionnaire!$E$20),0)","v":0},{"$f":"IF(E48=TRUE,L30+(2*Questionnaire!$E$20),0)","v":0},{"$f":"IF(F48=TRUE,L30+(3*Questionnaire!$E$20),0)","v":0},{"$f":"IF(G48=TRUE,L30+(4*Questionnaire!$E$20),0)","v":0},{"$f":"IF(H48=TRUE,L30+(5*Questionnaire!$E$20),0)","v":0},{"$f":"IF(I48=TRUE,L30+(6*Questionnaire!$E$20),0)","v":0},{"$f":"IF(J48,L31,0)","v":0},{"$f":"IF(K48=TRUE,L31+(1*Questionnaire!$E$20),0)","v":0},{"$f":"IF(L48=TRUE,L31+(2*Questionnaire!$E$20),0)","v":0},{"$f":"IF(M48=TRUE,L31+(3*Questionnaire!$E$20),0)","v":0},{"$f":"IF(N48=TRUE,L31+(4*Questionnaire!$E$20),0)","v":0},{"$f":"IF(O48=TRUE,L31+(5*Questionnaire!$E$20),0)","v":0},{"$f":"IF(P48=TRUE,L31+(6*Questionnaire!$E$20),0)","v":0},{"$f":"IF(Q48,L32,0)","v":0},{"$f":"IF(R48=TRUE,L32+(1*Questionnaire!$E$20),0)","v":0},{"$f":"IF(S48=TRUE,L32+(2*Questionnaire!$E$20),0)","v":0},{"$f":"IF(T48=TRUE,L32+(3*Questionnaire!$E$20),0)","v":0},{"$f":"IF(U48=TRUE,L32+(4*Questionnaire!$E$20),0)","v":0},{"$f":"IF(V48=TRUE,L32+(5*Questionnaire!$E$20),0)","v":0},{"$f":"IF(W48=TRUE,L32+(6*Questionnaire!$E$20),0)","v":0},{"$f":"IF(X48,L33,0)","v":0},{"$f":"IF(Y48=TRUE,L33+(1*Questionnaire!$E$20),0)","v":0},{"$f":"IF(Z48=TRUE,L33+(2*Questionnaire!$E$20),0)","v":0},{"$f":"IF(AA48=TRUE,L33+(3*Questionnaire!$E$20),0)","v":0},{"$f":"IF(AB48=TRUE,L33+(4*Questionnaire!$E$20),0)","v":0},{"$f":"IF(AC48=TRUE,L33+(5*Questionnaire!$E$20),0)","v":0},{"$f":"IF(AD48=TRUE,L33+(6*Questionnaire!$E$20),0)","v":0}]
["Bandes riveraines",null,{"$f":"AND('Menu simulation'!$H10=TRUE,OR(C46=TRUE,C48=TRUE))","v":false},{"$f":"AND('Menu simulation'!$H10=TRUE,OR(D46=TRUE,D48=TRUE))","v":false},{"$f":"AND('Menu simulation'!$H10=TRUE,OR(E46=TRUE,E48=TRUE))","v":false},{"$f":"AND('Menu simulation'!$H10=TRUE,OR(F46=TRUE,F48=TRUE))","v":false},{"$f":"AND('Menu simulation'!$H10=TRUE,OR(G46=TRUE,G48=TRUE))","v":false},{"$f":"AND('Menu simulation'!$H10=TRUE,OR(H46=TRUE,H48=TRUE))","v":false},{"$f":"AND('Menu simulation'!$H10=TRUE,OR(I46=TRUE,I48=TRUE))","v":false},{"$f":"AND('Menu simulation'!$H10=TRUE,OR(J46=TRUE,J48=TRUE))","v":false},{"$f":"AND('Menu simulation'!$H10=TRUE,OR(K46=TRUE,K48=TRUE))","v":false},{"$f":"AND('Menu simulation'!$H10=TRUE,OR(L46=TRUE,L48=TRUE))","v":false},{"$f":"AND('Menu simulation'!$H10=TRUE,OR(M46=TRUE,M48=TRUE))","v":false},{"$f":"AND('Menu simulation'!$H10=TRUE,OR(N46=TRUE,N48=TRUE))","v":false},{"$f":"AND('Menu simulation'!$H10=TRUE,OR(O46=TRUE,O48=TRUE))","v":false},{"$f":"AND('Menu simulation'!$H10=TRUE,OR(P46=TRUE,P48=TRUE))","v":false},{"$f":"AND('Menu simulation'!$H10=TRUE,OR(Q46=TRUE,Q48=TRUE))","v":false},{"$f":"AND('Menu simulation'!$H10=TRUE,OR(R46=TRUE,R48=TRUE))","v":false},{"$f":"AND('Menu simulation'!$H10=TRUE,OR(S46=TRUE,S48=TRUE))","v":false},{"$f":"AND('Menu simulation'!$H10=TRUE,OR(T46=TRUE,T48=TRUE))","v":false},{"$f":"AND('Menu simulation'!$H10=TRUE,OR(U46=TRUE,U48=TRUE))","v":false},{"$f":"AND('Menu simulation'!$H10=TRUE,OR(V46=TRUE,V48=TRUE))","v":false},{"$f":"AND('Menu simulation'!$H10=TRUE,OR(W46=TRUE,W48=TRUE))","v":false},{"$f":"AND('Menu simulation'!$H10=TRUE,OR(X46=TRUE,X48=TRUE))","v":false},{"$f":"AND('Menu simulation'!$H10=TRUE,OR(Y46=TRUE,Y48=TRUE))","v":false},{"$f":"AND('Menu simulation'!$H10=TRUE,OR(Z46=TRUE,Z48=TRUE))","v":false},{"$f":"AND('Menu simulation'!$H10=TRUE,OR(AA46=TRUE,AA48=TRUE))","v":false},{"$f":"AND('Menu simulation'!$H10=TRUE,OR(AB46=TRUE,AB48=TRUE))","v":false},{"$f":"AND('Menu simulation'!$H10=TRUE,OR(AC46=TRUE,AC48=TRUE))","v":false},{"$f":"AND('Menu simulation'!$H10=TRUE,OR(AD46=TRUE,AD48=TRUE))","v":false}]
["Bandes riveraines",null,{"$f":"IF(C46=TRUE,C47-$C42,IF(C48=TRUE,C49-$C42,0))","v":0},{"$f":"IF(D46=TRUE,D47-$C42,IF(D48=TRUE,D49-$C42,0))","v":0},{"$f":"IF(E46=TRUE,E47-$C42,IF(E48=TRUE,E49-$C42,0))","v":0},{"$f":"IF(F46=TRUE,F47-$C42,IF(F48=TRUE,F49-$C42,0))","v":0},{"$f":"IF(G46=TRUE,G47-$C42,IF(G48=TRUE,G49-$C42,0))","v":0},{"$f":"IF(H46=TRUE,H47-$C42,IF(H48=TRUE,H49-$C42,0))","v":0},0,0,0,0,0,{"$f":"IF(N46=TRUE,N47-$C42,IF(N48=TRUE,N49-$C42,0))","v":0},0,0,{"$f":"IF(Q46=TRUE,Q47-$C42,IF(Q48=TRUE,Q49-$C42,0))","v":0},0,0,0,{"$f":"IF(U46=TRUE,U47-$C42,IF(U48=TRUE,U49-$C42,0))","v":0},0,0,0,0,0,0,{"$f":"IF(AB46=TRUE,AB47-$C42,IF(AB48=TRUE,AB49-$C42,0))","v":0},0,0]
[]
[]
["Longueur de la protection",null,null,{"$f":"Questionnaire!G81","v":0}]
[]
["Rotation sur combien d'années ?",null,null,{"$f":"IF(Questionnaire!G83=0,1,Questionnaire!G83)","v":1}]
[]
[]
[null,null,null,null,null,null,"Année de référence",null,"Marge produits sur débours /ha"]
["Choix de rotation"]
[{"$f":"Questionnaire!C$87","v":"..."},null,null,null,null,null,1,null,{"$f":"SUMIF(Paramètres!F$48:G$72,A$61:A$80,Paramètres!H$48:I$72)","v":0}]
[{"$f":"Questionnaire!C$88","v":"..."},null,null,null,null,null,2,null,{"$f":"SUMIF(Paramètres!F$48:G$72,A$61:A$80,Paramètres!H$48:I$72)","v":0}]
[{"$f":"Questionnaire!C$89","v":"..."},null,null,null,null,null,3,null,{"$f":"SUMIF(Paramètres!F$48:G$72,A$61:A$80,Paramètres!H$48:I$72)","v":0}]
[{"$f":"Questionnaire!E$87","v":"..."},null,null,null,null,null,4,null,{"$f":"SUMIF(Paramètres!F$48:G$72,A$61:A$80,Paramètres!H$48:I$72)","v":0}]
[{"$f":"Questionnaire!E$88","v":"..."},null,null,null,null,null,5,null,{"$f":"SUMIF(Paramètres!F$48:G$72,A$61:A$80,Paramètres!H$48:I$72)","v":0}]
[{"$f":"Questionnaire!E$89","v":"..."},null,null,null,null,null,6,null,{"$f":"SUMIF(Paramètres!F$48:G$72,A$61:A$80,Paramètres!H$48:I$72)","v":0}]
[{"$f":"Questionnaire!G$87","v":"..."},null,null,null,null,null,7,null,{"$f":"SUMIF(Paramètres!F$48:G$72,A$61:A$80,Paramètres!H$48:I$72)","v":0}]
[{"$f":"Questionnaire!G$88","v":"..."},null,null,null,null,null,8,null,{"$f":"SUMIF(Paramètres!F$48:G$72,A$61:A$80,Paramètres!H$48:I$72)","v":0}]
[{"$f":"Questionnaire!G$89","v":"..."},null,null,null,null,null,9,null,{"$f":"SUMIF(Paramètres!F$48:G$72,A$61:A$80,Paramètres!H$48:I$72)","v":0}]
[{"$f":"Questionnaire!I$87","v":"..."},null,null,null,null,null,10,null,{"$f":"SUMIF(Paramètres!F$48:G$72,A$61:A$80,Paramètres!H$48:I$72)","v":0}]
[{"$f":"Questionnaire!I$88","v":"..."},null,null,null,null,null,11,null,{"$f":"SUMIF(Paramètres!F$48:G$72,A$61:A$80,Paramètres!H$48:I$72)","v":0}]
[{"$f":"Questionnaire!I$89","v":"..."},null,null,null,null,null,12,null,{"$f":"SUMIF(Paramètres!F$48:G$72,A$61:A$80,Paramètres!H$48:I$72)","v":0}]
[{"$f":"Questionnaire!K$87","v":"..."},null,null,null,null,null,13,null,{"$f":"SUMIF(Paramètres!F$48:G$72,A$61:A$80,Paramètres!H$48:I$72)","v":0}]
[{"$f":"Questionnaire!K$88","v":"..."},null,null,null,null,null,14,null,{"$f":"SUMIF(Paramètres!F$48:G$72,A$61:A$80,Paramètres!H$48:I$72)","v":0}]
[{"$f":"Questionnaire!K$89","v":"..."},null,null,null,null,null,15,null,{"$f":"SUMIF(Paramètres!F$48:G$72,A$61:A$80,Paramètres!H$48:I$72)","v":0}]
[{"$f":"Questionnaire!M$87","v":"..."},null,null,null,null,null,16,null,{"$f":"SUMIF(Paramètres!F$48:G$72,A$61:A$80,Paramètres!H$48:I$72)","v":0}]
[{"$f":"Questionnaire!M$88","v":"..."},null,null,null,null,null,17,null,{"$f":"SUMIF(Paramètres!F$48:G$72,A$61:A$80,Paramètres!H$48:I$72)","v":0}]
[{"$f":"Questionnaire!M$89","v":"..."},null,null,null,null,null,18,null,{"$f":"SUMIF(Paramètres!F$48:G$72,A$61:A$80,Paramètres!H$48:I$72)","v":0}]
[{"$f":"Questionnaire!O$87","v":"..."},null,null,null,null,null,19,null,{"$f":"SUMIF(Paramètres!F$48:G$72,A$61:A$80,Paramètres!H$48:I$72)","v":0}]
[{"$f":"Questionnaire!O$88","v":"..."},null,null,null,null,null,20,null,{"$f":"SUMIF(Paramètres!F$48:G$72,A$61:A$80,Paramètres!H$48:I$72)","v":0}]
[null,null,null,null,null,null,"Marge moyenne des produits sur débours   /ha",null,{"$f":"(SUM(I61:J80))/D56","v":0}]
[]
[]
["Calcul de l'espace perdu"]
[]
["Identification des haies",null,"Largeur en m à 5 ans",null,"Largeur en m à 10 ans",null,"Largeur en m  à 20 ans",null,"Largeur en m  à 40ans"]
[]
["A",null,{"$f":"IF('Menu simulation'!$H$10=TRUE,SUM(C51:I51),SUM(C47:I47,C49:I49))","v":0},null,{"$f":"IF('Menu simulation'!$H$10=TRUE,SUM(J51:P51),SUM(J47:P47,J49:P49))","v":0},null,{"$f":"IF('Menu simulation'!$H$10=TRUE,SUM(Q51:W51),SUM(Q47:W47,Q49:W49))","v":0},null,{"$f":"IF('Menu simulation'!$H$10=TRUE,SUM(X51:AD51),SUM(X47:AD47,X49:AD49))","v":0}]
[]
[]
[]
[]
["Identification des haies",null,"Surface perdue à 5 ans (ha)",null,"Surface perdue à 10 ans (ha)",null,"Surface perdue à 20 ans               (ha)",null,"Surface perdue à 40 ans (ha)"]
[]
["A",null,{"$f":"$D$54*C88/10000","v":0},null,{"$f":"$D$54*E88/10000","v":0},null,{"$f":"$D$54*G88/10000","v":0},null,{"$f":"$D$54*I88/10000","v":0}]
[]
[]
[]
[]
["Calcul des revenus perdus"]
[]
["Identification des haies",null,"Revenus perdus de 0 à 5 ans",null,"Revenus perdus de 5 à 10 ans",null,"Revenus perdus de 10 à 20 ans",null,"Revenus perdus de 20 à 40 ans"]
[]
["A",null,{"$f":"C95*$I$81*5","v":0},null,{"$f":"E95*$I$81*5","v":0},null,{"$f":"G95*$I$81*10","v":0},null,{"$f":"I95*$I$81*20","v":0}]
[]
[]
[]
["Total",null,{"$f":"SUM(C104:D107)","v":0},null,{"$f":"SUM(E104:F107)","v":0},null,{"$f":"SUM(G104:H107)","v":0},null,{"$f":"SUM(I104:J107)","v":0}]
[]
[]
["Détériorations",null,null,null,"Marge actualisée",null,"Marge actualisée accumulée"]
[]
["total cumulatif à l'an"]
[1,{"$f":"-1*$B$18/5","v":0},null,null,{"$f":"B114/POWER(1+Paramètres!$AF$14,A114)","v":0}]
[2,{"$f":"-1*$B$18/5","v":0},null,null,{"$f":"B115/POWER(1+Paramètres!$AF$14,A115)","v":0}]
[3,{"$f":"-1*$B$18/5","v":0},null,null,{"$f":"B116/POWER(1+Paramètres!$AF$14,A116)","v":0}]
[4,{"$f":"-1*$B$18/5","v":0},null,null,{"$f":"B117/POWER(1+Paramètres!$AF$14,A117)","v":0}]
[5,{"$f":"-1*$B$18/5","v":0},{"$f":"SUM(B114:B118)","v":0},null,{"$f":"B118/POWER(1+Paramètres!$AF$14,A118)","v":0},{"$f":"SUM(E114:E118)","v":0}]
[6,{"$f":"-1*$D$18/5","v":0},null,null,{"$f":"B119/POWER(1+Paramètres!$AF$14,A119)","v":0}]
[7,{"$f":"-1*$D$18/5","v":0},null,null,{"$f":"B120/POWER(1+Paramètres!$AF$14,A120)","v":0}]
[8,{"$f":"-1*$D$18/5","v":0},null,null,{"$f":"B121/POWER(1+Paramètres!$AF$14,A121)","v":0}]
[9,{"$f":"-1*$D$18/5","v":0},null,null,{"$f":"B122/POWER(1+Paramètres!$AF$14,A122)","v":0}]
[10,{"$f":"-1*$D$18/5","v":0},{"$f":"SUM(B119:B123)","v":0},null,{"$f":"B123/POWER(1+Paramètres!$AF$14,A123)","v":0},{"$f":"SUM(E119:E123)","v":0},{"$f":"SUM(E114:E123)","v":0}]
[11,{"$f":"-1*$F$18/10","v":0},null,null,{"$f":"B124/POWER(1+Paramètres!$AF$14,A124)","v":0}]
[12,{"$f":"-1*$F$18/10","v":0},null,null,{"$f":"B125/POWER(1+Paramètres!$AF$14,A125)","v":0}]
[13,0,null,null,{"$f":"B126/POWER(1+Paramètres!$AF$14,A126)","v":0}]
[14,0,null,null,{"$f":"B127/POWER(1+Paramètres!$AF$14,A127)","v":0}]
[15,0,null,null,{"$f":"B128/POWER(1+Paramètres!$AF$14,A128)","v":0}]
[16,0,null,null,{"$f":"B129/POWER(1+Paramètres!$AF$14,A129)","v":0}]
[17,0,null,null,{"$f":"B130/POWER(1+Paramètres!$AF$14,A130)","v":0}]
[18,0,null,null,{"$f":"B131/POWER(1+Paramètres!$AF$14,A131)","v":0}]
[19,0,null,null,{"$f":"B132/POWER(1+Paramètres!$AF$14,A132)","v":0}]
[20,0,{"$f":"SUM(B124:B133)","v":0},null,{"$f":"B133/POWER(1+Paramètres!$AF$14,A133)","v":0},{"$f":"SUM(E124:E133)","v":0},{"$f":"SUM(E114:E133)","v":0}]
[21,{"$f":"-1*$H$18/20","v":0},null,null,{"$f":"B134/POWER(1+Paramètres!$AF$14,A134)","v":0}]
[22,{"$f":"-1*$H$18/20","v":0},null,null,{"$f":"B135/POWER(1+Paramètres!$AF$14,A135)","v":0}]
[23,0,null,null,{"$f":"B136/POWER(1+Paramètres!$AF$14,A136)","v":0}]
[24,0,null,null,{"$f":"B137/POWER(1+Paramètres!$AF$14,A137)","v":0}]
[25,0,null,null,{"$f":"B138/POWER(1+Paramètres!$AF$14,A138)","v":0}]
[26,0,null,null,{"$f":"B139/POWER(1+Paramètres!$AF$14,A139)","v":0}]
[27,0,null,null,{"$f":"B140/POWER(1+Paramètres!$AF$14,A140)","v":0}]
[28,0,null,null,{"$f":"B141/POWER(1+Paramètres!$AF$14,A141)","v":0}]
[29,0,null,null,{"$f":"B142/POWER(1+Paramètres!$AF$14,A142)","v":0}]
[30,0,null,null,{"$f":"B143/POWER(1+Paramètres!$AF$14,A143)","v":0}]
[31,0,null,null,{"$f":"B144/POWER(1+Paramètres!$AF$14,A144)","v":0}]
[32,0,null,null,{"$f":"B145/POWER(1+Paramètres!$AF$14,A145)","v":0}]
[33,0,null,null,{"$f":"B146/POWER(1+Paramètres!$AF$14,A146)","v":0}]
[34,0,null,null,{"$f":"B147/POWER(1+Paramètres!$AF$14,A147)","v":0}]
[35,0,null,null,{"$f":"B148/POWER(1+Paramètres!$AF$14,A148)","v":0}]
[36,0,null,null,{"$f":"B149/POWER(1+Paramètres!$AF$14,A149)","v":0}]
[37,0,null,null,{"$f":"B150/POWER(1+Paramètres!$AF$14,A150)","v":0}]
[38,0,null,null,{"$f":"B151/POWER(1+Paramètres!$AF$14,A151)","v":0}]
[39,0,null,null,{"$f":"B152/POWER(1+Paramètres!$AF$14,A152)","v":0}]
[40,0,{"$f":"SUM(B134:B153)","v":0},null,{"$f":"B153/POWER(1+Paramètres!$AF$14,A153)","v":0},{"$f":"SUM(E134:E153)","v":0},{"$f":"SUM(E114:E153)","v":0}]

{"sheet":"Entretien des écrans boisés","index":17,"n_rows":139,"n_cols":23,"rows_kept":139,"cut":false,"hidden":false,"merged":[[23,15,23,18],[96,0,97,2],[96,4,97,5],[98,0,98,1],[98,4,98,5],[32,0,32,1],[31,0,31,1],[96,6,97,6],[6,2,6,3],[17,1,17,2],[6,4,6,5],[8,4,8,5],[10,4,10,5],[12,4,12,5],[7,2,7,3],[7,4,7,5],[8,2,8,3],[17,3,17,4],[9,2,9,3],[9,4,9,5],[10,2,10,3],[17,5,17,6],[11,2,11,3],[11,4,11,5],[0,0,0,9],[3,1,5,1],[3,6,5,6],[3,7,5,7],[3,2,5,3],[3,4,5,5],[3,8,5,8],[12,2,12,3],[13,2,13,3],[13,4,13,5],[19,7,19,9],[15,1,16,2],[15,3,16,4],[15,5,16,6],[15,7,16,8],[17,7,17,8]]}
[]
[]
[]
[null,"Période","Améliorations",null,"Détériorations",null,"Marge","Marge actualisée ","Marge actualisée accumulée"]
[]
[]
[null,"0-5 ans",0,null,{"$f":"C104","v":-90.000000000000014},null,{"$f":"C7+E7","v":-90.000000000000014},{"$f":"F104","v":-75.822548140182846},{"$f":"F104","v":-75.822548140182846}]
[]
[null,"5-10 ans",0,null,{"$f":"C109","v":0},null,{"$f":"C9+E9","v":0},{"$f":"F109","v":0},{"$f":"G109","v":-75.822548140182846}]
[]
[null,"10-20 ans",0,null,{"$f":"C119","v":0},null,{"$f":"C11+E11","v":0},{"$f":"F119","v":0},{"$f":"G119","v":-75.822548140182846}]
[]
[null,"20-40 ans",0,null,{"$f":"C139","v":0},null,{"$f":"C13+E13","v":0},{"$f":"F139","v":0},{"$f":"G139","v":-75.822548140182846}]
[]
[]
[null,"Coûts liés à l'entretien de 0 à 5 ans",null,"Coûts liés à l'entretien de 5 à 10 ans",null,"Coûts liés à l'entretien de 10 à 20 ans",null,"Coûts liés à l'entretien de 20 à 40 ans"]
[]
[null,{"$f":"(F22+F24+(IF(F41=\"Oui\",F26,0))+(IF(F43=\"Oui\",V35,0))+(IF(F45=\"Oui\",W35,0)))*(1-Questionnaire!G68)","v":90.000000000000014},null,{"$f":"(IF(F41=\"Oui\",H41,0))+(IF(F43=\"Oui\",V36,0)+(IF(F45=\"Oui\",W36,0)))*(1-Questionnaire!G68)","v":0},null,{"$f":"(IF(F43=\"Oui\",V37,0)+IF(F45=\"Oui\",W37,0))*(1-Questionnaire!G68)","v":0},null,{"$f":"(IF(F43=\"Oui\",V38,0)+IF(F45=\"Oui\",W38,0))*(1-Questionnaire!G68)","v":0}]
[]
[null,null,null,null,null,"Coûts total sur 40 ans",null,"Critères retenus pour fin de calcul"]
[]
["Remplacement des arbres morts la première année",null,null,null,null,{"$f":"IF(F37=$A$49,H37,0)","v":300}]
[]
["Fauchage et inspection phytosanitaire les 5 premières années",null,null,null,null,{"$f":"IF(F39=$A$49,H39,0)","v":0},null,null,null,null,null,null,null,null,null,"Croissance"]
[null,null,null,null,null,null,null,null,null,null,null,null,null,null,null,"Année","PEH (m)",null,"FNO (m)"]
["Protection contre les rongeurs les 5 premières années",null,null,null,null,{"$f":"IF(F41=$A$49,H41,0)","v":0},null,null,null,null,null,"La protection contre les rongeurs été retunue pour le scénarion conservateur seulement",null,null,"Hauteur à la plantation",1,1,null,0.5]
[null,null,null,null,null,null,null,null,null,null,null,null,null,null,null,2,{"$f":"MIN('Amélioration de rendement'!M$35+Q26,Paramètres!I$100)","v":2},{"$f":"IF(Q27<=5,\"t\",\"e\")","v":"t"},{"$f":"MIN('Amélioration de rendement'!M$36+S26,Paramètres!I$101)","v":1},"t"]
["Taille de formation",null,null,null,null,{"$f":"IF(F43=$A$49,H43,0)","v":0},null,null,null,null,null,null,null,null,null,3,{"$f":"MIN('Amélioration de rendement'!M$35+Q27,Paramètres!I$100)","v":3},null,{"$f":"MIN('Amélioration de rendement'!M$36+S27,Paramètres!I$101)","v":1.5}]
[null,null,null,null,null,null,null,null,null,null,null,null,null,null,null,4,{"$f":"MIN('Amélioration de rendement'!M$35+Q28,Paramètres!I$100)","v":4},null,{"$f":"MIN('Amélioration de rendement'!M$36+S28,Paramètres!I$101)","v":2},null,"Taille (m)","Élagage PEH","Élagage FNO"]
["Recépage des arbustes",null,null,null,null,{"$f":"IF($F$45=$A$49,H45,0)","v":0},null,null,null,null,null,null,null,null,null,5,{"$f":"MIN('Amélioration de rendement'!M$35+Q29,Paramètres!I$100)","v":5},"te",{"$f":"MIN('Amélioration de rendement'!M$36+S29,Paramètres!I$101)","v":2.5},"t",5,{"$f":"Paramètres!I100-0.1","v":24.9},{"$f":"Paramètres!I101-0.1","v":14.9}]
[null,null,null,null,null,null,null,null,null,null,null,null,null,null,null,6,{"$f":"MIN('Amélioration de rendement'!M$35+Q30,Paramètres!I$100)","v":6},null,{"$f":"MIN('Amélioration de rendement'!M$36+S30,Paramètres!I$101)","v":3},null,1.5,5,5]
["Longueur totale des haies :",null,{"$f":"SUM('Devis d''implantation des écrans'!F6:Q6)","v":0},"m",null,null,null,null,null,null,null,null,"Coûts recépage mécanisé saule ($/km)",200,null,7,{"$f":"MIN('Amélioration de rendement'!M$35+Q31,Paramètres!I$100)","v":7},null,{"$f":"MIN('Amélioration de rendement'!M$36+S31,Paramètres!I$101)","v":3.5},null,0]
["Nombre d'arbres total :",null,{"$f":"'Devis d''implantation des écrans'!D47","v":0},"arbres",null,null,null,null,null,null,null,null,"Coûts recépage mécanisé saule ($/m)",{"$f":"N32/1000","v":0.2},null,8,{"$f":"MIN('Amélioration de rendement'!M$35+Q32,Paramètres!I$100)","v":8},null,{"$f":"MIN('Amélioration de rendement'!M$36+S32,Paramètres!I$101)","v":4}]
[null,null,null,null,null,null,null,null,null,null,null,null,"Coûts recépage mécanisé arbustes ($/arbuste)",3,null,9,{"$f":"MIN('Amélioration de rendement'!M$35+Q33,Paramètres!I$100)","v":9},null,{"$f":"MIN('Amélioration de rendement'!M$36+S33,Paramètres!I$101)","v":4.5},null,null,"Taille et élagage","Recépage"]
[null,null,null,null,null,null,null,null,null,null,null,null,null,null,null,10,{"$f":"MIN('Amélioration de rendement'!M$35+Q34,Paramètres!I$100)","v":10},"e",{"$f":"MIN('Amélioration de rendement'!M$36+S34,Paramètres!I$101)","v":5},"te","0-5 ans",{"$f":"(N51*1)+(N52*2)+(N53*1)+((('Devis d''implantation des écrans'!B$72*2/80*Paramètres!I$29)+('Devis d''implantation des écrans'!B$72*2*Paramètres!I$30))*(IF(AND('Devis d''implantation des écrans'!D44=0,'Devis d''implantation des écrans'!D43=0),0,2)))","v":0},{"$f":"IF(AND('Devis d''implantation des écrans'!D46>0,SUM('Devis d''implantation des écrans'!D42:D45)=0),'Entretien des écrans boisés'!N33*Questionnaire!E16,0)","v":0}]
[null,null,null,null,null,"Choix",null,"Coût",null,null,null,null,null,null,null,11,{"$f":"MIN('Amélioration de rendement'!M$35+Q35,Paramètres!I$100)","v":11},null,{"$f":"MIN('Amélioration de rendement'!M$36+S35,Paramètres!I$101)","v":5.5},null,"5-10 ans",{"$f":"(N52*1)+(N54*1)+(N55*1)+((('Devis d''implantation des écrans'!B$72*2/80*Paramètres!I$29)+('Devis d''implantation des écrans'!B$72*2*Paramètres!I$30))*(IF(AND('Devis d''implantation des écrans'!D44=0,'Devis d''implantation des écrans'!D43=0),0,3)))","v":0},{"$f":"IF(AND('Devis d''implantation des écrans'!D46>0,SUM('Devis d''implantation des écrans'!D42:D45)=0),'Entretien des écrans boisés'!N33*Questionnaire!E16,0)+IF('Devis d''implantation des écrans'!D45>0,SUM('Devis d''implantation des écrans'!D45:D46,0)*N34)","v":0}]
["Remplacement des arbres morts la deuxème année",null,null,null,null,{"$f":"IF(OR(Questionnaire!G70=\"Yes\",Questionnaire!G70=\"Oui\"),\"Oui\",\"Non\")","v":"Oui"},null,{"$f":"(('Devis d''implantation des écrans'!P48+(('Devis d''implantation des écrans'!L65+'Devis d''implantation des écrans'!L66)*2))*Paramètres!I36)+300","v":300},null,null,null,null,null,null,null,12,{"$f":"MIN('Amélioration de rendement'!M$35+Q36,Paramètres!I$100)","v":12},null,{"$f":"MIN('Amélioration de rendement'!M$36+S36,Paramètres!I$101)","v":6},null,"10-20 ans",{"$f":"(N55*1)+(N56*2)+((('Devis d''implantation des écrans'!B$72*2/80*Paramètres!I$29)+('Devis d''implantation des écrans'!B$72*2*Paramètres!I$30))*(IF(AND('Devis d''implantation des écrans'!D44=0,'Devis d''implantation des écrans'!D43=0),0,5)))","v":0},{"$f":"(IF(AND('Devis d''implantation des écrans'!D46>0,SUM('Devis d''implantation des écrans'!D42:D45)=0),'Entretien des écrans boisés'!N33*Questionnaire!E16,0)*4)+(IF('Devis d''implantation des écrans'!D45>0,SUM('Devis d''implantation des écrans'!D45:D46,0)*N34)*2)","v":0}]
[null,null,null,null,null,null,null,null,null,null,null,null,null,null,null,13,{"$f":"MIN('Amélioration de rendement'!M$35+Q37,Paramètres!I$100)","v":13},null,{"$f":"MIN('Amélioration de rendement'!M$36+S37,Paramètres!I$101)","v":6.5},null,"20-40 ans",{"$f":"(N56*2)+((('Devis d''implantation des écrans'!B$72*2/80*Paramètres!I$29)+('Devis d''implantation des écrans'!B$72*2*Paramètres!I$30))*(IF(AND('Devis d''implantation des écrans'!D44=0,'Devis d''implantation des écrans'!D43=0),0,(IF('Devis d''implantation des écrans'!D44>0,5,2)))))","v":0},{"$f":"(IF(AND('Devis d''implantation des écrans'!D46>0,SUM('Devis d''implantation des écrans'!D42:D45)=0),'Entretien des écrans boisés'!N33*Questionnaire!E16,0)*8)+(IF('Devis d''implantation des écrans'!D45>0,SUM('Devis d''implantation des écrans'!D45:D46,0)*N34)*4)","v":0}]
["Fauchage et inspection phytosanitaire les 5 premières années",null,null,null,null,{"$f":"IF(OR(Questionnaire!G72=\"Yes\",Questionnaire!G72=\"Oui\"),\"Oui\",\"Non\")","v":"Oui"},null,{"$f":"('Devis d''implantation des écrans'!P3*2/1000/1*Paramètres!I37)*Paramètres!I39*5","v":0},null,null,null,null,null,null,null,14,{"$f":"MIN('Amélioration de rendement'!M$35+Q38,Paramètres!I$100)","v":14},null,{"$f":"MIN('Amélioration de rendement'!M$36+S38,Paramètres!I$101)","v":7},null,null,{"$f":"SUM(V35:V38)","v":0}]
[null,null,null,null,null,null,null,null,"matériel","retrait",null,null,null,"Temps de pose protection (min/arbre)",null,15,{"$f":"MIN('Amélioration de rendement'!M$35+Q39,Paramètres!I$100)","v":15},"e",{"$f":"MIN('Amélioration de rendement'!M$36+S39,Paramètres!I$101)","v":7.5},"e"]
["Protection contre les rongeurs les 5 premières années",null,null,null,null,{"$f":"IF(OR(Questionnaire!H62=\"Yes\",Questionnaire!H62=\"Oui\"),\"Oui\",\"Non\")","v":"Non"},null,{"$f":"IF(AND(OR(Questionnaire!$H$62=\"Oui\",Questionnaire!$H$62=\"Yes\"),Questionnaire!$H$64=TRUE),J41,0)+IF(AND(OR(Questionnaire!$H$62=\"Oui\",Questionnaire!$H$62=\"Yes\"),Questionnaire!$F$64=TRUE),J42,0)","v":0},{"$f":"'Devis d''implantation des écrans'!L58","v":0},{"$f":"'Devis d''implantation des écrans'!L69","v":0},"Rongeurs seulement avec spirales",null,"Spirales",3.5,null,16,{"$f":"MIN('Amélioration de rendement'!M$35+Q40,Paramètres!I$100)","v":16},null,{"$f":"MIN('Amélioration de rendement'!M$36+S40,Paramètres!I$101)","v":8}]
[null,null,null,null,null,null,null,null,{"$f":"'Devis d''implantation des écrans'!L59+'Devis d''implantation des écrans'!L58","v":0},{"$f":"'Devis d''implantation des écrans'!L70+'Devis d''implantation des écrans'!L69","v":0},"Chevreuils et rongeurs avec tubes (Climanet)",null,"Climanet",7,null,17,{"$f":"MIN('Amélioration de rendement'!M$35+Q41,Paramètres!I$100)","v":17},null,{"$f":"MIN('Amélioration de rendement'!M$36+S41,Paramètres!I$101)","v":8.5}]
["Taille de formation et élagage",null,null,null,null,{"$f":"IF(OR(Questionnaire!G74=\"Yes\",Questionnaire!G74=\"Oui\"),\"Oui\",\"Non\")","v":"Oui"},null,{"$f":"SUM(V35:V38)","v":0},null,null,null,null,null,null,null,18,{"$f":"MIN('Amélioration de rendement'!M$35+Q42,Paramètres!I$100)","v":18},null,{"$f":"MIN('Amélioration de rendement'!M$36+S42,Paramètres!I$101)","v":9}]
[null,null,null,null,null,null,null,null,null,null,null,null,null,null,null,19,{"$f":"MIN('Amélioration de rendement'!M$35+Q43,Paramètres!I$100)","v":19},null,{"$f":"MIN('Amélioration de rendement'!M$36+S43,Paramètres!I$101)","v":9.5},null,"À régler si on modifie la croissance annuelle"]
["Recépage des arbustes",null,null,null,null,{"$f":"IF(OR(Questionnaire!G76=\"Yes\",Questionnaire!G76=\"Oui\"),\"Oui\",\"Non\")","v":"Oui"},null,{"$f":"SUM(W35:W38)","v":0},null,null,null,null,null,"Temps de taille de formation (min./arbre)",null,20,{"$f":"MIN('Amélioration de rendement'!M$35+Q44,Paramètres!I$100)","v":20},null,{"$f":"MIN('Amélioration de rendement'!M$36+S44,Paramètres!I$101)","v":10},{"$f":"IF(S45<=5,\"t\",\"e\")","v":"e"}]
[null,null,null,null,null,null,null,null,null,null,null,null,"1 à 3 m",0.66,null,21,{"$f":"IF(Questionnaire!C$111=TRUE,0,MIN('Amélioration de rendement'!M$35+Q45,Paramètres!I$100))","v":21},null,{"$f":"MIN('Amélioration de rendement'!M$36+S45,Paramètres!I$101)","v":10.5}]
[null,null,null,null,null,null,null,null,null,null,null,null,"3 à 5 m",1.25,null,22,{"$f":"IF(Questionnaire!C$111=TRUE,0,MIN('Amélioration de rendement'!M$35+Q46,Paramètres!I$100))","v":22},null,{"$f":"MIN('Amélioration de rendement'!M$36+S46,Paramètres!I$101)","v":11}]
["Choix",null,null,null,null,null,null,null,null,null,null,null,"5 m et plus",1.25,null,23,{"$f":"IF(Questionnaire!C$111=TRUE,0,MIN('Amélioration de rendement'!M$35+Q47,Paramètres!I$100))","v":23},null,{"$f":"MIN('Amélioration de rendement'!M$36+S47,Paramètres!I$101)","v":11.5}]
["Oui",null,null,null,null,null,null,null,null,null,null,null,null,null,null,24,{"$f":"IF(Questionnaire!C$111=TRUE,0,MIN('Amélioration de rendement'!M$35+Q48,Paramètres!I$100))","v":24},null,{"$f":"MIN('Amélioration de rendement'!M$36+S48,Paramètres!I$101)","v":12}]
["Non",null,null,null,null,null,null,null,null,null,null,null,"Taille détails","Coût de taille/visite\n(sans frais de déplacement)","Nombre de visites",25,{"$f":"IF(Questionnaire!C$111=TRUE,0,MIN('Amélioration de rendement'!M$35+Q49,Paramètres!I$100))","v":25},null,{"$f":"MIN('Amélioration de rendement'!M$36+S49,Paramètres!I$101)","v":12.5},"e"]
[null,null,null,null,null,null,null,null,null,null,null,null,"PEH 1 à 3 m",{"$f":"('Devis d''implantation des écrans'!D$43*N46/60)*Paramètres!I$38","v":0},1,26,{"$f":"IF(Questionnaire!C$111=TRUE,0,MIN('Amélioration de rendement'!M$35+Q50,Paramètres!I$100))","v":25},null,{"$f":"MIN('Amélioration de rendement'!M$36+S50,Paramètres!I$101)","v":13}]
[null,null,null,null,null,null,null,null,null,null,null,null,"FNO 1 à 3 m",{"$f":"'Devis d''implantation des écrans'!D$44*N46/60*Paramètres!I$38","v":0},2,27,{"$f":"IF(Questionnaire!C$111=TRUE,0,MIN('Amélioration de rendement'!M$35+Q51,Paramètres!I$100))","v":25},null,{"$f":"MIN('Amélioration de rendement'!M$36+S51,Paramètres!I$101)","v":13.5}]
[null,null,null,null,null,null,null,null,null,null,null,null,"PEH 3 à 5 m",{"$f":"'Devis d''implantation des écrans'!D$43*N47/60*Paramètres!I$38","v":0},1,28,{"$f":"IF(Questionnaire!C$111=TRUE,0,MIN('Amélioration de rendement'!M$35+Q52,Paramètres!I$100))","v":25},null,{"$f":"MIN('Amélioration de rendement'!M$36+S52,Paramètres!I$101)","v":14}]
[null,null,null,null,null,null,null,null,null,null,null,null,"FNO 3 à 5 m",{"$f":"'Devis d''implantation des écrans'!D$44*N47/60*Paramètres!I$38","v":0},1,29,{"$f":"IF(Questionnaire!C$111=TRUE,0,MIN('Amélioration de rendement'!M$35+Q53,Paramètres!I$100))","v":25},null,{"$f":"MIN('Amélioration de rendement'!M$36+S53,Paramètres!I$101)","v":14.5}]
[null,null,null,null,null,null,null,null,null,null,null,null,"Élagage PEH 5 m et plus",{"$f":"'Devis d''implantation des écrans'!D$43*N48/60*Paramètres!I$38","v":0},3,30,{"$f":"IF(Questionnaire!C$111=TRUE,0,MIN('Amélioration de rendement'!M$35+Q54,Paramètres!I$100))","v":25},null,{"$f":"MIN('Amélioration de rendement'!M$36+S54,Paramètres!I$101)","v":15},{"$f":"IF(S55<=5,\"t\",\"e\")","v":"e"}]
[null,null,null,null,null,null,null,null,null,null,null,null,"Élagage FNO 5 m et plus",{"$f":"'Devis d''implantation des écrans'!D$44*N48/60*Paramètres!I$38","v":0},5,31,{"$f":"IF(Questionnaire!C$111=TRUE,0,MIN('Amélioration de rendement'!M$35+Q55,Paramètres!I$100))","v":25},null,{"$f":"MIN('Amélioration de rendement'!M$36+S55,Paramètres!I$101)","v":15}]
[null,null,null,null,null,null,null,null,null,null,null,null,null,null,null,32,{"$f":"IF(Questionnaire!C$111=TRUE,0,MIN('Amélioration de rendement'!M$35+Q56,Paramètres!I$100))","v":25},null,{"$f":"MIN('Amélioration de rendement'!M$36+S56,Paramètres!I$101)","v":15}]
[null,null,null,null,null,null,null,null,null,null,null,null,null,null,null,33,{"$f":"IF(Questionnaire!C$111=TRUE,0,MIN('Amélioration de rendement'!M$35+Q57,Paramètres!I$100))","v":25},null,{"$f":"MIN('Amélioration de rendement'!M$36+S57,Paramètres!I$101)","v":15}]
[null,null,null,null,null,null,null,null,null,null,null,null,null,null,null,34,{"$f":"IF(Questionnaire!C$111=TRUE,0,MIN('Amélioration de rendement'!M$35+Q58,Paramètres!I$100))","v":25},null,{"$f":"MIN('Amélioration de rendement'!M$36+S58,Paramètres!I$101)","v":15}]
[null,null,null,null,null,null,null,null,null,null,null,null,null,null,null,35,{"$f":"IF(Questionnaire!C$111=TRUE,0,MIN('Amélioration de rendement'!M$35+Q59,Paramètres!I$100))","v":25},null,{"$f":"MIN('Amélioration de rendement'!M$36+S59,Paramètres!I$101)","v":15}]
[null,null,null,null,null,null,null,null,null,null,null,null,null,null,null,36,{"$f":"IF(Questionnaire!C$111=TRUE,0,MIN('Amélioration de rendement'!M$35+Q60,Paramètres!I$100))","v":25},null,{"$f":"MIN('Amélioration de rendement'!M$36+S60,Paramètres!I$101)","v":15}]
[null,null,null,null,null,null,null,null,null,null,null,null,null,null,null,37,{"$f":"IF(Questionnaire!C$111=TRUE,0,MIN('Amélioration de rendement'!M$35+Q61,Paramètres!I$100))","v":25},null,{"$f":"MIN('Amélioration de rendement'!M$36+S61,Paramètres!I$101)","v":15}]
[null,null,null,null,null,null,null,null,null,null,null,null,null,null,null,38,{"$f":"IF(Questionnaire!C$111=TRUE,0,MIN('Amélioration de rendement'!M$35+Q62,Paramètres!I$100))","v":25},null,{"$f":"MIN('Amélioration de rendement'!M$36+S62,Paramètres!I$101)","v":15}]
[null,null,null,null,null,null,null,null,null,null,null,null,null,null,null,39,{"$f":"IF(Questionnaire!C$111=TRUE,0,MIN('Amélioration de rendement'!M$35+Q63,Paramètres!I$100))","v":25},null,{"$f":"MIN('Amélioration de rendement'!M$36+S63,Paramètres!I$101)","v":15}]
[null,null,null,null,null,null,null,null,null,null,null,null,null,null,null,40,{"$f":"IF(Questionnaire!C$111=TRUE,0,MIN('Amélioration de rendement'!M$35+Q64,Paramètres!I$100))","v":25},null,{"$f":"MIN('Amélioration de rendement'!M$36+S64,Paramètres!I$101)","v":15}]
[]
[]
[]
[]
[]
[]
[]
[]
[]
[]
[]
[]
[]
[]
[]
[]
[]
[]
[]
[]
[]
[]
[]
[]
[]
[]
[]
[]
[]
[]
[]
["Détériorations",null,null,null,"Marge actualisée",null,"Marge actualisée accumulée"]
[]
["total cumulatif à l'an"]
[1,{"$f":"-1*$B$18/5","v":-18.000000000000004},null,null,{"$f":"B100/POWER(1+Paramètres!$AF$14,A100)","v":-16.981132075471702}]
[2,{"$f":"-1*$B$18/5","v":-18.000000000000004},null,null,{"$f":"B101/POWER(1+Paramètres!$AF$14,A101)","v":-16.019935920256319}]
[3,{"$f":"-1*$B$18/5","v":-18.000000000000004},null,null,{"$f":"B102/POWER(1+Paramètres!$AF$14,A102)","v":-15.113147094581432}]
[4,{"$f":"-1*$B$18/5","v":-18.000000000000004},null,null,{"$f":"B103/POWER(1+Paramètres!$AF$14,A103)","v":-14.25768593828437}]
[5,{"$f":"-1*$B$18/5","v":-18.000000000000004},{"$f":"SUM(B100:B104)","v":-90.000000000000014},null,{"$f":"B104/POWER(1+Paramètres!$AF$14,A104)","v":-13.450647111589026},{"$f":"SUM(E100:E104)","v":-75.822548140182846}]
[6,{"$f":"-1*$D$18/5","v":0},null,null,{"$f":"B105/POWER(1+Paramètres!$AF$14,A105)","v":0}]
[7,{"$f":"-1*$D$18/5","v":0},null,null,{"$f":"B106/POWER(1+Paramètres!$AF$14,A106)","v":0}]
[8,{"$f":"-1*$D$18/5","v":0},null,null,{"$f":"B107/POWER(1+Paramètres!$AF$14,A107)","v":0}]
[9,{"$f":"-1*$D$18/5","v":0},null,null,{"$f":"B108/POWER(1+Paramètres!$AF$14,A108)","v":0}]
[10,{"$f":"-1*$D$18/5","v":0},{"$f":"SUM(B105:B109)","v":0},null,{"$f":"B109/POWER(1+Paramètres!$AF$14,A109)","v":0},{"$f":"SUM(E105:E109)","v":0},{"$f":"SUM(E100:E109)","v":-75.822548140182846}]
[11,{"$f":"-1*$F$18/10","v":0},null,null,{"$f":"B110/POWER(1+Paramètres!$AF$14,A110)","v":0}]
[12,{"$f":"-1*$F$18/10","v":0},null,null,{"$f":"B111/POWER(1+Paramètres!$AF$14,A111)","v":0}]
[13,0,null,null,{"$f":"B112/POWER(1+Paramètres!$AF$14,A112)","v":0}]
[14,0,null,null,{"$f":"B113/POWER(1+Paramètres!$AF$14,A113)","v":0}]
[15,0,null,null,{"$f":"B114/POWER(1+Paramètres!$AF$14,A114)","v":0}]
[16,0,null,null,{"$f":"B115/POWER(1+Paramètres!$AF$14,A115)","v":0}]
[17,0,null,null,{"$f":"B116/POWER(1+Paramètres!$AF$14,A116)","v":0}]
[18,0,null,null,{"$f":"B117/POWER(1+Paramètres!$AF$14,A117)","v":0}]
[19,0,null,null,{"$f":"B118/POWER(1+Paramètres!$AF$14,A118)","v":0}]
[20,0,{"$f":"SUM(B110:B119)","v":0},null,{"$f":"B119/POWER(1+Paramètres!$AF$14,A119)","v":0},{"$f":"SUM(E110:E119)","v":0},{"$f":"SUM(E100:E119)","v":-75.822548140182846}]
[21,{"$f":"-1*$H$18/10","v":0},null,null,{"$f":"B120/POWER(1+Paramètres!$AF$14,A120)","v":0}]
[22,{"$f":"-1*$H$18/10","v":0},null,null,{"$f":"B121/POWER(1+Paramètres!$AF$14,A121)","v":0}]
[23,0,null,null,{"$f":"B122/POWER(1+Paramètres!$AF$14,A122)","v":0}]
[24,0,null,null,{"$f":"B123/POWER(1+Paramètres!$AF$14,A123)","v":0}]
[25,0,null,null,{"$f":"B124/POWER(1+Paramètres!$AF$14,A124)","v":0}]
[26,0,null,null,{"$f":"B125/POWER(1+Paramètres!$AF$14,A125)","v":0}]
[27,0,null,null,{"$f":"B126/POWER(1+Paramètres!$AF$14,A126)","v":0}]
[28,0,null,null,{"$f":"B127/POWER(1+Paramètres!$AF$14,A127)","v":0}]
[29,0,null,null,{"$f":"B128/POWER(1+Paramètres!$AF$14,A128)","v":0}]
[30,0,null,null,{"$f":"B129/POWER(1+Paramètres!$AF$14,A129)","v":0}]
[31,0,null,null,{"$f":"B130/POWER(1+Paramètres!$AF$14,A130)","v":0}]
[32,0,null,null,{"$f":"B131/POWER(1+Paramètres!$AF$14,A131)","v":0}]
[33,0,null,null,{"$f":"B132/POWER(1+Paramètres!$AF$14,A132)","v":0}]
[34,0,null,null,{"$f":"B133/POWER(1+Paramètres!$AF$14,A133)","v":0}]
[35,0,null,null,{"$f":"B134/POWER(1+Paramètres!$AF$14,A134)","v":0}]
[36,0,null,null,{"$f":"B135/POWER(1+Paramètres!$AF$14,A135)","v":0}]
[37,0,null,null,{"$f":"B136/POWER(1+Paramètres!$AF$14,A136)","v":0}]
[38,0,null,null,{"$f":"B137/POWER(1+Paramètres!$AF$14,A137)","v":0}]
[39,0,null,null,{"$f":"B138/POWER(1+Paramètres!$AF$14,A138)","v":0}]
[40,0,{"$f":"SUM(B120:B139)","v":0},null,{"$f":"B139/POWER(1+Paramètres!$AF$14,A139)","v":0},{"$f":"SUM(E120:E139)","v":0},{"$f":"SUM(E100:E139)","v":-75.822548140182846}]

{"sheet":"Calcul d'économie de chauffage","index":18,"n_rows":139,"n_cols":10,"rows_kept":139,"cut":false,"hidden":false,"merged":[[98,0,98,1],[98,4,98,5],[7,2,7,3],[10,4,10,5],[17,5,17,6],[17,3,17,4],[8,2,8,3],[10,2,10,3],[12,2,12,3],[9,2,9,3],[12,4,12,5],[96,0,97,2],[51,1,51,2],[53,1,54,2],[53,3,54,4],[96,6,97,6],[17,7,17,8],[15,7,16,8],[0,0,0,9],[3,1,5,1],[3,6,5,6],[3,7,5,7],[3,2,5,3],[3,4,5,5],[3,8,5,8],[13,2,13,3],[13,4,13,5],[17,1,17,2],[15,1,16,2],[15,3,16,4],[15,5,16,6],[6,4,6,5],[6,2,6,3],[8,4,8,5],[41,1,42,2],[41,3,42,4],[41,5,42,6],[11,2,11,3],[11,4,11,5],[7,4,7,5],[9,4,9,5],[41,7,42,8],[43,1,43,2],[43,3,43,4],[43,5,43,6],[43,7,43,8],[96,4,97,5],[53,5,54,6],[45,7,46,8],[47,1,47,2],[47,3,47,4],[47,5,47,6],[47,7,47,8],[45,1,46,2],[45,3,46,4],[45,5,46,6],[53,7,54,8],[55,1,55,2],[49,7,50,8],[49,3,50,4],[49,5,50,6],[51,7,51,8],[55,7,55,8],[49,1,50,2],[55,3,55,4],[55,5,55,6],[51,3,51,4],[51,5,51,6]]}
[]
[]
[]
[null,"Période","Améliorations",null,"Détériorations",null,"Marge","Marge actualisée ","Marge actualisée accumulée"]
[]
[]
[null,"0-5 ans",{"$f":"C104","v":0},null,0,null,{"$f":"C7+E7","v":0},{"$f":"F104","v":0},{"$f":"F104","v":0}]
[]
[null,"5-10 ans",{"$f":"C109","v":0},null,0,null,{"$f":"C9+E9","v":0},{"$f":"F109","v":0},{"$f":"G109","v":0}]
[]
[null,"10-20 ans",{"$f":"C119","v":0},null,0,null,{"$f":"C11+E11","v":0},{"$f":"F119","v":0},{"$f":"G119","v":0}]
[]
[null,"20-40 ans",{"$f":"C139","v":0},null,0,null,{"$f":"C13+E13","v":0},{"$f":"F139","v":0},{"$f":"G139","v":0}]
[]
[]
[null,"Économies liées au chauffage de 0 à 5 ans",null,"Économies liées au chauffage de 5 à 10 ans",null,"Économies liées au chauffage de 10 à 20 ans",null,"Économies liées au chauffage de 20 à 40 ans"]
[]
[null,{"$f":"IF($D$41=TRUE,B44)+IF($D$45=TRUE,B48)+IF($D$49=TRUE,B52)+IF($D$53=TRUE,B56)","v":0},null,{"$f":"IF($D$41=TRUE,D44)+IF($D$45=TRUE,D48)+IF($D$49=TRUE,D52)+IF($D$53=TRUE,D56)","v":0},null,{"$f":"IF($D$41=TRUE,F44)+IF($D$45=TRUE,F48)+IF($D$49=TRUE,F52)+IF($D$53=TRUE,F56)","v":0},null,{"$f":"IF($D$41=TRUE,H44)+IF($D$45=TRUE,H48)+IF($D$49=TRUE,H52)+IF($D$53=TRUE,H56)","v":0}]
[]
["Quels sont vos coûts de chauffage annuels actuels ?",null,null,null,null,null,null,null,{"$f":"Questionnaire!H93*J20","v":0},{"$f":"IF('Menu simulation'!H8=TRUE,1,0)","v":0}]
["ou"]
["À combien s'élève votre facture d'énergie (incluant l'éclairage , la ventilation, etc…) ?"]
[]
["Les économies à la maturité des haies seront de :",null,null,null,null,null,null,null,{"$f":"Questionnaire!H97","v":0.1}]
[]
["Efficacité de réduction des coûts de chauffage",null,null,null,null,null,null,"Conservateur 5%"]
[null,"Sans PEH","Avec PEH",null,null,null,null,"Réaliste 10%"]
["0-5 ans",0,0,null,null,null,null,"Optimiste 15%"]
[]
["5-10 ans",0,0.5,null,"Facteur de conversion pour les haies de feuillus seulement",null,null,null,0.4]
[null,null,null,null,"PEH seul après 20 ans",null,null,null,{"$f":"IF('Devis d''implantation des écrans'!D44>0,I30,0)","v":0}]
["10-20 ans",0.25,1]
[]
["20-40 ans",1,1]
[]
[]
[]
[]
[{"$f":"I24","v":0.1}]
[]
[null,"Avec conifère, avec  PEH",null,{"$f":"AND('Devis d''implantation des écrans'!$D$42>0,'Devis d''implantation des écrans'!$D$43>0)","v":false},"* le facteur de correction pour les feuillus a été appliqué"]
[null,"Économies liées au chauffage de 0 à 5 ans*",null,"Économies liées au chauffage de 5 à 10 ans*",null,"Économies liées au chauffage de 10 à 20 ans*",null,"Économies liées au chauffage de 20 à 40 ans"]
[]
[null,{"$f":"IF(Questionnaire!H95=TRUE,0,$I$20*$A$39*5*$C$28*I31)","v":0},null,{"$f":"IF(Questionnaire!H95=TRUE,0,$I$20*$A$39*5*$C$30*I31)","v":0},null,{"$f":"IF(Questionnaire!H95=TRUE,0,$I$20*$A$39*10*$C$32*I31)","v":0},null,{"$f":"IF(Questionnaire!H95=TRUE,0,$I$20*$A$39*20*$C$34)","v":0}]
[null,"Avec conifère sans PEH",null,{"$f":"AND('Devis d''implantation des écrans'!$D$42>0,'Devis d''implantation des écrans'!$D$43=0)","v":false}]
[null,"Économies liées au chauffage de 0 à 5 ans",null,"Économies liées au chauffage de 5 à 10 ans",null,"Économies liées au chauffage de 10 à 20 ans",null,"Économies liées au chauffage de 20 à 40 ans"]
[]
[null,{"$f":"IF(Questionnaire!H95=TRUE,0,$I$20*$A$39*5*$B$28)","v":0},null,{"$f":"IF(Questionnaire!H95=TRUE,0,$I$20*$A$39*5*$B$30)","v":0},null,{"$f":"IF(Questionnaire!H95=TRUE,0,$I$20*$A$39*10*$B$32)","v":0},null,{"$f":"IF(Questionnaire!H95=TRUE,0,$I$20*$A$39*20*$B$34)","v":0}]
[null,"Sans conifère, avec PEH",null,{"$f":"AND('Devis d''implantation des écrans'!$D$42=0,'Devis d''implantation des écrans'!$D$43>0)","v":false}]
[null,"Économies liées au chauffage de 0 à 5 ans*",null,"Économies liées au chauffage de 5 à 10 ans*",null,"Économies liées au chauffage de 10 à 20 ans*",null,"Économies liées au chauffage de 20 à 40 ans*"]
[]
[null,{"$f":"IF(Questionnaire!H95=TRUE,0,$I$20*$A$39*5*$C$28*$I$31)","v":0},null,{"$f":"IF(Questionnaire!H95=TRUE,0,$I$20*$A$39*5*$C$30*$I$31)","v":0},null,{"$f":"IF(Questionnaire!H95=TRUE,0,$I$20*$A$39*10*$C$32*$I$30)","v":0},null,{"$f":"IF(Questionnaire!H95=TRUE,0,IF(Questionnaire!C111=TRUE,0,$I$20*$A$39*20*$C$34*$I$31))","v":0}]
[null,"Sans conifère, sans PEH",null,{"$f":"AND('Devis d''implantation des écrans'!$D$42=0,'Devis d''implantation des écrans'!$D$43=0,'Devis d''implantation des écrans'!D44>0)","v":false}]
[null,"Économies liées au chauffage de 0 à 5 ans*",null,"Économies liées au chauffage de 5 à 10 ans*",null,"Économies liées au chauffage de 10 à 20 ans*",null,"Économies liées au chauffage de 20 à 40 ans*"]
[]
[null,{"$f":"IF(Questionnaire!H95=TRUE,0,$I$20*$A$39*5*$B$28*$I$31)","v":0},null,{"$f":"IF(Questionnaire!H95=TRUE,0,$I$20*$A$39*5*$B$30*$I$31)","v":0},null,{"$f":"IF(Questionnaire!H95=TRUE,0,$I$20*$A$39*10*$B$32*$I$30)","v":0},null,{"$f":"IF(Questionnaire!H95=TRUE,0,$I$20*$A$39*20*$B$34*$I$31)","v":0}]
[]
[]
[]
[]
[]
[]
[]
[]
[]
[]
[]
[]
[]
[]
[]
[]
[]
[]
[]
[]
[]
[]
[]
[]
[]
[]
[]
[]
[]
[]
[]
[]
[]
[]
[]
[]
[]
[]
[]
[]
["Améliorations",null,null,null,"Marge actualisée",null,"Marge actualisée accumulée"]
[]
["total cumulatif à l'an"]
[1,{"$f":"$B$18/5","v":0},null,null,{"$f":"B100/POWER(1+Paramètres!$AF$14,A100)","v":0}]
[2,{"$f":"$B$18/5","v":0},null,null,{"$f":"B101/POWER(1+Paramètres!$AF$14,A101)","v":0}]
[3,{"$f":"$B$18/5","v":0},null,null,{"$f":"B102/POWER(1+Paramètres!$AF$14,A102)","v":0}]
[4,{"$f":"$B$18/5","v":0},null,null,{"$f":"B103/POWER(1+Paramètres!$AF$14,A103)","v":0}]
[5,{"$f":"$B$18/5","v":0},{"$f":"SUM(B100:B104)","v":0},null,{"$f":"B104/POWER(1+Paramètres!$AF$14,A104)","v":0},{"$f":"SUM(E100:E104)","v":0}]
[6,{"$f":"$D$18/5","v":0},null,null,{"$f":"B105/POWER(1+Paramètres!$AF$14,A105)","v":0}]
[7,{"$f":"$D$18/5","v":0},null,null,{"$f":"B106/POWER(1+Paramètres!$AF$14,A106)","v":0}]
[8,{"$f":"$D$18/5","v":0},null,null,{"$f":"B107/POWER(1+Paramètres!$AF$14,A107)","v":0}]
[9,{"$f":"$D$18/5","v":0},null,null,{"$f":"B108/POWER(1+Paramètres!$AF$14,A108)","v":0}]
[10,{"$f":"$D$18/5","v":0},{"$f":"SUM(B105:B109)","v":0},null,{"$f":"B109/POWER(1+Paramètres!$AF$14,A109)","v":0},{"$f":"SUM(E105:E109)","v":0},{"$f":"SUM(E100:E109)","v":0}]
[11,{"$f":"$F$18/10","v":0},null,null,{"$f":"B110/POWER(1+Paramètres!$AF$14,A110)","v":0}]
[12,{"$f":"$F$18/10","v":0},null,null,{"$f":"B111/POWER(1+Paramètres!$AF$14,A111)","v":0}]
[13,0,null,null,{"$f":"B112/POWER(1+Paramètres!$AF$14,A112)","v":0}]
[14,0,null,null,{"$f":"B113/POWER(1+Paramètres!$AF$14,A113)","v":0}]
[15,0,null,null,{"$f":"B114/POWER(1+Paramètres!$AF$14,A114)","v":0}]
[16,0,null,null,{"$f":"B115/POWER(1+Paramètres!$AF$14,A115)","v":0}]
[17,0,null,null,{"$f":"B116/POWER(1+Paramètres!$AF$14,A116)","v":0}]
[18,0,null,null,{"$f":"B117/POWER(1+Paramètres!$AF$14,A117)","v":0}]
[19,0,null,null,{"$f":"B118/POWER(1+Paramètres!$AF$14,A118)","v":0}]
[20,0,{"$f":"SUM(B110:B119)","v":0},null,{"$f":"B119/POWER(1+Paramètres!$AF$14,A119)","v":0},{"$f":"SUM(E110:E119)","v":0},{"$f":"SUM(E100:E119)","v":0}]
[21,{"$f":"$H$18/20","v":0},null,null,{"$f":"B120/POWER(1+Paramètres!$AF$14,A120)","v":0}]
[22,{"$f":"$H$18/20","v":0},null,null,{"$f":"B121/POWER(1+Paramètres!$AF$14,A121)","v":0}]
[23,0,null,null,{"$f":"B122/POWER(1+Paramètres!$AF$14,A122)","v":0}]
[24,0,null,null,{"$f":"B123/POWER(1+Paramètres!$AF$14,A123)","v":0}]
[25,0,null,null,{"$f":"B124/POWER(1+Paramètres!$AF$14,A124)","v":0}]
[26,0,null,null,{"$f":"B125/POWER(1+Paramètres!$AF$14,A125)","v":0}]
[27,0,null,null,{"$f":"B126/POWER(1+Paramètres!$AF$14,A126)","v":0}]
[28,0,null,null,{"$f":"B127/POWER(1+Paramètres!$AF$14,A127)","v":0}]
[29,0,null,null,{"$f":"B128/POWER(1+Paramètres!$AF$14,A128)","v":0}]
[30,0,null,null,{"$f":"B129/POWER(1+Paramètres!$AF$14,A129)","v":0}]
[31,0,null,null,{"$f":"B130/POWER(1+Paramètres!$AF$14,A130)","v":0}]
[32,0,null,null,{"$f":"B131/POWER(1+Paramètres!$AF$14,A131)","v":0}]
[33,0,null,null,{"$f":"B132/POWER(1+Paramètres!$AF$14,A132)","v":0}]
[34,0,null,null,{"$f":"B133/POWER(1+Paramètres!$AF$14,A133)","v":0}]
[35,0,null,null,{"$f":"B134/POWER(1+Paramètres!$AF$14,A134)","v":0}]
[36,0,null,null,{"$f":"B135/POWER(1+Paramètres!$AF$14,A135)","v":0}]
[37,0,null,null,{"$f":"B136/POWER(1+Paramètres!$AF$14,A136)","v":0}]
[38,0,null,null,{"$f":"B137/POWER(1+Paramètres!$AF$14,A137)","v":0}]
[39,0,null,null,{"$f":"B138/POWER(1+Paramètres!$AF$14,A138)","v":0}]
[40,0,{"$f":"SUM(B120:B139)","v":0},null,{"$f":"B139/POWER(1+Paramètres!$AF$14,A139)","v":0},{"$f":"SUM(E120:E139)","v":0},{"$f":"SUM(E100:E139)","v":0}]

{"sheet":"Calcul d'économie déneigement","index":19,"n_rows":139,"n_cols":10,"rows_kept":139,"cut":false,"hidden":false,"merged":[[96,6,97,6],[96,0,97,2],[96,4,97,5],[98,0,98,1],[98,4,98,5],[17,1,17,2],[17,3,17,4],[17,5,17,6],[17,7,17,8],[15,1,16,2],[15,3,16,4],[15,5,16,6],[15,7,16,8],[0,0,0,9],[3,1,5,1],[3,2,5,3],[3,6,5,6],[3,7,5,7],[3,4,5,5],[3,8,5,8],[6,2,6,3],[6,4,6,5],[7,2,7,3],[7,4,7,5],[8,2,8,3],[8,4,8,5],[12,2,12,3],[12,4,12,5],[13,2,13,3],[13,4,13,5],[9,2,9,3],[9,4,9,5],[10,2,10,3],[10,4,10,5],[11,2,11,3],[11,4,11,5]]}
[]
[]
[]
[null,"Période","Améliorations",null,"Détériorations",null,"Marge","Marge actualisée ","Marge actualisée accumulée"]
[]
[]
[null,"0-5 ans",{"$f":"C104","v":0},null,0,null,{"$f":"C7+E7","v":0},{"$f":"F104","v":0},{"$f":"F104","v":0}]
[]
[null,"5-10 ans",{"$f":"C109","v":0},null,0,null,{"$f":"C9+E9","v":0},{"$f":"F109","v":0},{"$f":"G109","v":0}]
[]
[null,"10-20 ans",{"$f":"C119","v":0},null,0,null,{"$f":"C11+E11","v":0},{"$f":"F119","v":0},{"$f":"G119","v":0}]
[]
[null,"20-40 ans",{"$f":"C139","v":0},null,0,null,{"$f":"C13+E13","v":0},{"$f":"F139","v":0},{"$f":"G139","v":0}]
[]
[]
[null,"Économies liées au déneigement de 0 à 5 ans",null,"Économies liées au déneigement de 5 à 10 ans",null,"Économies liées au déneigement de 10 à 20 ans",null,"Économies liées au déneigement de 20 à 40 ans"]
[]
[null,{"$f":"IF($J$31=TRUE,5*$G$24*$G$22*$C$27,IF(AND($J$32=TRUE,$J$31=FALSE),5*$G$24*$G$22*$B$27))","v":false},null,{"$f":"IF($J$31=TRUE,5*$G$24*$G$22*$C$29,IF(AND($J$32=TRUE,$J$31=FALSE),5*$G$24*$G$22*$B$29))","v":false},null,{"$f":"IF($J$31=TRUE,10*$G$24*$G$22*$C$31,IF(AND($J$32=TRUE,$J$31=FALSE),10*$G$24*$G$22*$B$31))","v":false},null,{"$f":"IF($J$31=TRUE,20*$G$24*$G$22*$C$33,IF(AND($J$32=TRUE,$J$31=FALSE),20*$G$24*$G$22*$B$33))","v":false}]
[]
[]
[]
["Combien d'heures par année sont consacrées aux opérations de déneigement ?",null,null,null,null,null,{"$f":"Questionnaire!H102*I22","v":0}," /heures",{"$f":"IF('Menu simulation'!H8=TRUE,1,0)","v":0}]
[]
["Taux horaire pour les opérations de déneigement ?",null,null,null,null,null,{"$f":"Questionnaire!H104","v":85}," $/heure"]
[]
["Efficacité de réduction des coûts de déneigement"]
["0-5 ans",0,0.1]
[null,null,null,null,"Facteur de conversion pour les haies de feuillus seulement",null,null,null,0]
["5-10 ans",{"$f":"B33/2","v":0.1},0.2]
[]
["10-20 ans",{"$f":"B33","v":0.2},{"$f":"C33","v":0.2},null,null,null,null,"Saule",null,{"$f":"'Devis d''implantation des écrans'!D46>0","v":false}]
[null,null,null,null,"Conservateur 10%",null,null,"Conifère et arbuste",null,{"$f":"OR('Devis d''implantation des écrans'!D42>0,'Devis d''implantation des écrans'!D45>0)","v":false}]
["20-40 ans",0.2,0.2,null,"Réaliste 20%"]
[null,null,null,null,"Optimiste 30%"]
[]
[]
[]
[]
[]
[]
[]
[]
[]
[]
[]
[]
[]
[]
[]
[]
[]
[]
[]
[]
[]
[]
[]
[]
[]
[]
[]
[]
[]
[]
[]
[]
[]
[]
[]
[]
[]
[]
[]
[]
[]
[]
[]
[]
[]
[]
[]
[]
[]
[]
[]
[]
[]
[]
[]
[]
[]
[]
[]
[]
[]
[]
["Améliorations",null,null,null,"Marge actualisée",null,"Marge actualisée accumulée"]
[]
["total cumulatif à l'an"]
[1,{"$f":"$B$18/5","v":0},null,null,{"$f":"B100/POWER(1+Paramètres!$AF$14,A100)","v":0}]
[2,{"$f":"$B$18/5","v":0},null,null,{"$f":"B101/POWER(1+Paramètres!$AF$14,A101)","v":0}]
[3,{"$f":"$B$18/5","v":0},null,null,{"$f":"B102/POWER(1+Paramètres!$AF$14,A102)","v":0}]
[4,{"$f":"$B$18/5","v":0},null,null,{"$f":"B103/POWER(1+Paramètres!$AF$14,A103)","v":0}]
[5,{"$f":"$B$18/5","v":0},{"$f":"SUM(B100:B104)","v":0},null,{"$f":"B104/POWER(1+Paramètres!$AF$14,A104)","v":0},{"$f":"SUM(E100:E104)","v":0}]
[6,{"$f":"$D$18/5","v":0},null,null,{"$f":"B105/POWER(1+Paramètres!$AF$14,A105)","v":0}]
[7,{"$f":"$D$18/5","v":0},null,null,{"$f":"B106/POWER(1+Paramètres!$AF$14,A106)","v":0}]
[8,{"$f":"$D$18/5","v":0},null,null,{"$f":"B107/POWER(1+Paramètres!$AF$14,A107)","v":0}]
[9,{"$f":"$D$18/5","v":0},null,null,{"$f":"B108/POWER(1+Paramètres!$AF$14,A108)","v":0}]
[10,{"$f":"$D$18/5","v":0},{"$f":"SUM(B105:B109)","v":0},null,{"$f":"B109/POWER(1+Paramètres!$AF$14,A109)","v":0},{"$f":"SUM(E105:E109)","v":0},{"$f":"SUM(E100:E109)","v":0}]
[11,{"$f":"$F$18/10","v":0},null,null,{"$f":"B110/POWER(1+Paramètres!$AF$14,A110)","v":0}]
[12,{"$f":"$F$18/10","v":0},null,null,{"$f":"B111/POWER(1+Paramètres!$AF$14,A111)","v":0}]
[13,0,null,null,{"$f":"B112/POWER(1+Paramètres!$AF$14,A112)","v":0}]
[14,0,null,null,{"$f":"B113/POWER(1+Paramètres!$AF$14,A113)","v":0}]
[15,0,null,null,{"$f":"B114/POWER(1+Paramètres!$AF$14,A114)","v":0}]
[16,0,null,null,{"$f":"B115/POWER(1+Paramètres!$AF$14,A115)","v":0}]
[17,0,null,null,{"$f":"B116/POWER(1+Paramètres!$AF$14,A116)","v":0}]
[18,0,null,null,{"$f":"B117/POWER(1+Paramètres!$AF$14,A117)","v":0}]
[19,0,null,null,{"$f":"B118/POWER(1+Paramètres!$AF$14,A118)","v":0}]
[20,0,{"$f":"SUM(B110:B119)","v":0},null,{"$f":"B119/POWER(1+Paramètres!$AF$14,A119)","v":0},{"$f":"SUM(E110:E119)","v":0},{"$f":"SUM(E100:E119)","v":0}]
[21,{"$f":"$H$18/20","v":0},null,null,{"$f":"B120/POWER(1+Paramètres!$AF$14,A120)","v":0}]
[22,{"$f":"$H$18/20","v":0},null,null,{"$f":"B121/POWER(1+Paramètres!$AF$14,A121)","v":0}]
[23,0,null,null,{"$f":"B122/POWER(1+Paramètres!$AF$14,A122)","v":0}]
[24,0,null,null,{"$f":"B123/POWER(1+Paramètres!$AF$14,A123)","v":0}]
[25,0,null,null,{"$f":"B124/POWER(1+Paramètres!$AF$14,A124)","v":0}]
[26,0,null,null,{"$f":"B125/POWER(1+Paramètres!$AF$14,A125)","v":0}]
[27,0,null,null,{"$f":"B126/POWER(1+Paramètres!$AF$14,A126)","v":0}]
[28,0,null,null,{"$f":"B127/POWER(1+Paramètres!$AF$14,A127)","v":0}]
[29,0,null,null,{"$f":"B128/POWER(1+Paramètres!$AF$14,A128)","v":0}]
[30,0,null,null,{"$f":"B129/POWER(1+Paramètres!$AF$14,A129)","v":0}]
[31,0,null,null,{"$f":"B130/POWER(1+Paramètres!$AF$14,A130)","v":0}]
[32,0,null,null,{"$f":"B131/POWER(1+Paramètres!$AF$14,A131)","v":0}]
[33,0,null,null,{"$f":"B132/POWER(1+Paramètres!$AF$14,A132)","v":0}]
[34,0,null,null,{"$f":"B133/POWER(1+Paramètres!$AF$14,A133)","v":0}]
[35,0,null,null,{"$f":"B134/POWER(1+Paramètres!$AF$14,A134)","v":0}]
[36,0,null,null,{"$f":"B135/POWER(1+Paramètres!$AF$14,A135)","v":0}]
[37,0,null,null,{"$f":"B136/POWER(1+Paramètres!$AF$14,A136)","v":0}]
[38,0,null,null,{"$f":"B137/POWER(1+Paramètres!$AF$14,A137)","v":0}]
[39,0,null,null,{"$f":"B138/POWER(1+Paramètres!$AF$14,A138)","v":0}]
[40,0,{"$f":"SUM(B120:B139)","v":0},null,{"$f":"B139/POWER(1+Paramètres!$AF$14,A139)","v":0},{"$f":"SUM(E120:E139)","v":0},{"$f":"SUM(E100:E139)","v":0}]

{"sheet":"Calcul du rendement en bois","index":20,"n_rows":136,"n_cols":26,"rows_kept":136,"cut":false,"hidden":false,"merged":[[23,10,25,10],[38,2,38,3],[38,4,38,5],[92,6,93,6],[92,0,93,2],[92,4,93,5],[39,2,39,3],[39,4,39,5],[47,8,47,9],[47,10,47,11],[45,6,45,7],[45,8,45,9],[45,10,45,11],[46,4,46,5],[46,6,46,7],[46,8,46,9],[94,0,94,1],[94,4,94,5],[47,4,47,5],[47,6,47,7],[57,0,57,6],[51,0,51,6],[46,10,46,11],[45,4,45,5],[43,8,43,9],[43,10,43,11],[44,4,44,5],[44,6,44,7],[44,8,44,9],[44,10,44,11],[43,4,43,5],[43,6,43,7],[41,10,41,11],[42,4,42,5],[42,6,42,7],[42,8,42,9],[42,10,42,11],[41,4,41,5],[41,6,41,7],[23,8,25,9],[9,2,9,3],[53,0,56,6],[36,4,36,5],[37,4,37,5],[36,2,36,3],[52,0,52,6],[37,2,37,3],[12,4,12,5],[35,4,35,5],[34,2,34,3],[34,4,34,5],[35,2,35,3],[41,8,41,9],[3,2,5,3],[6,2,6,3],[6,4,6,5],[7,2,7,3],[23,4,25,5],[23,2,25,3],[7,4,7,5],[10,2,10,3],[10,4,10,5],[11,2,11,3],[11,4,11,5],[25,12,25,19],[8,2,8,3],[8,4,8,5],[9,4,9,5],[0,0,0,9],[3,1,5,1],[3,8,5,8],[3,4,5,5],[3,6,5,6],[3,7,5,7],[12,2,12,3],[13,2,13,3],[13,4,13,5],[23,6,25,7],[21,0,21,2],[23,1,26,1]]}
[]
[]
[]
[null,"Période","Améliorations",null,"Détériorations",null,"Marge","Marge actualisée ","Marge actualisée accumulée"]
[]
[]
[null,"0-5 ans",{"$f":"C100","v":0},null,0,null,{"$f":"C7+E7","v":0},{"$f":"F100","v":0},{"$f":"F100","v":0}]
[]
[null,"5-10 ans",{"$f":"C105","v":0},null,0,null,{"$f":"C9+E9","v":0},{"$f":"F105","v":0},{"$f":"G105","v":0}]
[]
[null,"10-20 ans",{"$f":"C115","v":0},null,0,null,{"$f":"C11+E11","v":0},{"$f":"F115","v":0},{"$f":"G115","v":0}]
[]
[null,"20-40 ans",{"$f":"C135","v":0},null,0,null,{"$f":"C13+E13","v":0},{"$f":"F135","v":0},{"$f":"G135","v":0}]
[]
[null,null,null,null,null,"Rangée",null,null,null,null,null,null,"Rangée récoltée"]
["Nombre d'arbres pour calcul biomasse",null,null,null,null,1,2,3,4,5,6,7,"Toute",1,2,3,4,5,6,7,"Nombre d'arbre récolté"]
["Épinettes, Pins ou Thuyas",null,{"$f":"IF(Langue!$A$200 = \"FR\",Dictionnaire!A808,Dictionnaire!B808)","v":"CON"},{"$f":"SUM(F17:L17)","v":0},null,{"$f":"IF('Devis d''implantation des écrans'!F$14<=0.5,'Devis d''implantation des écrans'!F42,'Devis d''implantation des écrans'!F42*0.5/'Devis d''implantation des écrans'!F$14)","v":0},{"$f":"IF('Devis d''implantation des écrans'!G$14<=0.5,'Devis d''implantation des écrans'!G42,'Devis d''implantation des écrans'!G42*0.5/'Devis d''implantation des écrans'!G$14)","v":0},{"$f":"IF('Devis d''implantation des écrans'!H$14<=0.5,'Devis d''implantation des écrans'!H42,'Devis d''implantation des écrans'!H42*0.5/'Devis d''implantation des écrans'!H$14)","v":0},{"$f":"IF('Devis d''implantation des écrans'!I$14<=0.5,'Devis d''implantation des écrans'!I42,'Devis d''implantation des écrans'!I42*0.5/'Devis d''implantation des écrans'!I$14)","v":0},{"$f":"IF('Devis d''implantation des écrans'!J$14<=0.5,'Devis d''implantation des écrans'!J42,'Devis d''implantation des écrans'!J42*0.5/'Devis d''implantation des écrans'!J$14)","v":0},{"$f":"IF('Devis d''implantation des écrans'!K$14<=0.5,'Devis d''implantation des écrans'!K42,'Devis d''implantation des écrans'!K42*0.5/'Devis d''implantation des écrans'!K$14)","v":0},{"$f":"IF('Devis d''implantation des écrans'!L$14<=0.5,'Devis d''implantation des écrans'!L42,'Devis d''implantation des écrans'!L42*0.5/'Devis d''implantation des écrans'!L$14)","v":0},null,{"$f":"IF(Questionnaire!H112=\"Oui\",1,(IF(Questionnaire!H112=\"Yes\",1,0)))","v":0},{"$f":"IF(Questionnaire!I112=\"Oui\",1,(IF(Questionnaire!I112=\"Yes\",1,0)))","v":0},{"$f":"IF(Questionnaire!J112=\"Oui\",1,(IF(Questionnaire!J112=\"Yes\",1,0)))","v":0},{"$f":"IF(Questionnaire!K112=\"Oui\",1,(IF(Questionnaire!K112=\"Yes\",1,0)))","v":0},{"$f":"IF(Questionnaire!L112=\"Oui\",1,(IF(Questionnaire!L112=\"Yes\",1,0)))","v":0},{"$f":"IF(Questionnaire!M112=\"Oui\",1,(IF(Questionnaire!M112=\"Yes\",1,0)))","v":0},{"$f":"IF(Questionnaire!N112=\"Oui\",1,(IF(Questionnaire!N112=\"Yes\",1,0)))","v":0},{"$f":"(N17*F17+G17*O17+P17*H17+Q17*I17+R17*J17+K17*S17+T17*L17)","v":0}]
["Peupliers hybrides",null,{"$f":"IF(Langue!$A$200 = \"FR\",Dictionnaire!A809,Dictionnaire!B809)","v":"PEH"},{"$f":"SUM(F18:L18)","v":0},null,{"$f":"IF('Devis d''implantation des écrans'!F$14<=0.5,'Devis d''implantation des écrans'!F43,'Devis d''implantation des écrans'!F43*0.5/'Devis d''implantation des écrans'!F$14)","v":0},{"$f":"IF('Devis d''implantation des écrans'!G$14<=0.5,'Devis d''implantation des écrans'!G43,'Devis d''implantation des écrans'!G43*0.5/'Devis d''implantation des écrans'!G$14)","v":0},{"$f":"IF('Devis d''implantation des écrans'!H$14<=0.5,'Devis d''implantation des écrans'!H43,'Devis d''implantation des écrans'!H43*0.5/'Devis d''implantation des écrans'!H$14)","v":0},{"$f":"IF('Devis d''implantation des écrans'!I$14<=0.5,'Devis d''implantation des écrans'!I43,'Devis d''implantation des écrans'!I43*0.5/'Devis d''implantation des écrans'!I$14)","v":0},{"$f":"IF('Devis d''implantation des écrans'!J$14<=0.5,'Devis d''implantation des écrans'!J43,'Devis d''implantation des écrans'!J43*0.5/'Devis d''implantation des écrans'!J$14)","v":0},{"$f":"IF('Devis d''implantation des écrans'!K$14<=0.5,'Devis d''implantation des écrans'!K43,'Devis d''implantation des écrans'!K43*0.5/'Devis d''implantation des écrans'!K$14)","v":0},{"$f":"IF('Devis d''implantation des écrans'!L$14<=0.5,'Devis d''implantation des écrans'!L43,'Devis d''implantation des écrans'!L43*0.5/'Devis d''implantation des écrans'!L$14)","v":0},null,{"$f":"IF(Questionnaire!H111=\"Oui\",1,(IF(Questionnaire!H111=\"Yes\",1,0)))","v":0},{"$f":"IF(Questionnaire!I111=\"Oui\",1,(IF(Questionnaire!I111=\"Yes\",1,0)))","v":0},{"$f":"IF(Questionnaire!J111=\"Oui\",1,(IF(Questionnaire!J111=\"Yes\",1,0)))","v":0},{"$f":"IF(Questionnaire!K111=\"Oui\",1,(IF(Questionnaire!K111=\"Yes\",1,0)))","v":0},{"$f":"IF(Questionnaire!L111=\"Oui\",1,(IF(Questionnaire!L111=\"Yes\",1,0)))","v":0},{"$f":"IF(Questionnaire!M111=\"Oui\",1,(IF(Questionnaire!M111=\"Yes\",1,0)))","v":0},{"$f":"IF(Questionnaire!N111=\"Oui\",1,(IF(Questionnaire!N111=\"Yes\",1,0)))","v":0},{"$f":"(N18*F18+G18*O18+P18*H18+Q18*I18+R18*J18+K18*S18+T18*L18)","v":0}]
["Feuillus nobles",null,{"$f":"IF(Langue!$A$200 = \"FR\",Dictionnaire!A810,Dictionnaire!B810)","v":"FNO"},{"$f":"SUM(F19:L19)","v":0},null,{"$f":"IF('Devis d''implantation des écrans'!F$14<=0.5,'Devis d''implantation des écrans'!F44,'Devis d''implantation des écrans'!F44*0.5/'Devis d''implantation des écrans'!F$14)","v":0},{"$f":"IF('Devis d''implantation des écrans'!G$14<=0.5,'Devis d''implantation des écrans'!G44,'Devis d''implantation des écrans'!G44*0.5/'Devis d''implantation des écrans'!G$14)","v":0},{"$f":"IF('Devis d''implantation des écrans'!H$14<=0.5,'Devis d''implantation des écrans'!H44,'Devis d''implantation des écrans'!H44*0.5/'Devis d''implantation des écrans'!H$14)","v":0},{"$f":"IF('Devis d''implantation des écrans'!I$14<=0.5,'Devis d''implantation des écrans'!I44,'Devis d''implantation des écrans'!I44*0.5/'Devis d''implantation des écrans'!I$14)","v":0},{"$f":"IF('Devis d''implantation des écrans'!J$14<=0.5,'Devis d''implantation des écrans'!J44,'Devis d''implantation des écrans'!J44*0.5/'Devis d''implantation des écrans'!J$14)","v":0},{"$f":"IF('Devis d''implantation des écrans'!K$14<=0.5,'Devis d''implantation des écrans'!K44,'Devis d''implantation des écrans'!K44*0.5/'Devis d''implantation des écrans'!K$14)","v":0},{"$f":"IF('Devis d''implantation des écrans'!L$14<=0.5,'Devis d''implantation des écrans'!L44,'Devis d''implantation des écrans'!L44*0.5/'Devis d''implantation des écrans'!L$14)","v":0},null,{"$f":"IF(Questionnaire!H113=\"Oui\",1,(IF(Questionnaire!H113=\"Yes\",1,0)))","v":0},{"$f":"IF(Questionnaire!I113=\"Oui\",1,(IF(Questionnaire!I113=\"Yes\",1,0)))","v":0},{"$f":"IF(Questionnaire!J113=\"Oui\",1,(IF(Questionnaire!J113=\"Yes\",1,0)))","v":0},{"$f":"IF(Questionnaire!K113=\"Oui\",1,(IF(Questionnaire!K113=\"Yes\",1,0)))","v":0},{"$f":"IF(Questionnaire!L113=\"Oui\",1,(IF(Questionnaire!L113=\"Yes\",1,0)))","v":0},{"$f":"IF(Questionnaire!M113=\"Oui\",1,(IF(Questionnaire!M113=\"Yes\",1,0)))","v":0},{"$f":"IF(Questionnaire!N113=\"Oui\",1,(IF(Questionnaire!N113=\"Yes\",1,0)))","v":0},{"$f":"(N19*F19+G19*O19+P19*H19+Q19*I19+R19*J19+K19*S19+T19*L19)","v":0}]
["Arbustes",null,{"$f":"IF(Langue!$A$200 = \"FR\",Dictionnaire!A811,Dictionnaire!B811)","v":"ARB"},{"$f":"SUM(F20:L20)","v":0},null,{"$f":"IF('Devis d''implantation des écrans'!F$14<=0.5,'Devis d''implantation des écrans'!F45,'Devis d''implantation des écrans'!F45*0.5/'Devis d''implantation des écrans'!F$14)","v":0},{"$f":"IF('Devis d''implantation des écrans'!G$14<=0.5,'Devis d''implantation des écrans'!G45,'Devis d''implantation des écrans'!G45*0.5/'Devis d''implantation des écrans'!G$14)","v":0},{"$f":"IF('Devis d''implantation des écrans'!H$14<=0.5,'Devis d''implantation des écrans'!H45,'Devis d''implantation des écrans'!H45*0.5/'Devis d''implantation des écrans'!H$14)","v":0},{"$f":"IF('Devis d''implantation des écrans'!I$14<=0.5,'Devis d''implantation des écrans'!I45,'Devis d''implantation des écrans'!I45*0.5/'Devis d''implantation des écrans'!I$14)","v":0},{"$f":"IF('Devis d''implantation des écrans'!J$14<=0.5,'Devis d''implantation des écrans'!J45,'Devis d''implantation des écrans'!J45*0.5/'Devis d''implantation des écrans'!J$14)","v":0},{"$f":"IF('Devis d''implantation des écrans'!K$14<=0.5,'Devis d''implantation des écrans'!K45,'Devis d''implantation des écrans'!K45*0.5/'Devis d''implantation des écrans'!K$14)","v":0},{"$f":"IF('Devis d''implantation des écrans'!L$14<=0.5,'Devis d''implantation des écrans'!L45,'Devis d''implantation des écrans'!L45*0.5/'Devis d''implantation des écrans'!L$14)","v":0}]
["Saules hybrides",null,{"$f":"IF(Langue!$A$200 = \"FR\",Dictionnaire!A812,Dictionnaire!B812)","v":"SAH"},{"$f":"SUM(F21:L21)","v":0},null,{"$f":"IF('Devis d''implantation des écrans'!F$14<=0.5,'Devis d''implantation des écrans'!F46,'Devis d''implantation des écrans'!F46*0.5/'Devis d''implantation des écrans'!F$14)","v":0},{"$f":"IF('Devis d''implantation des écrans'!G$14<=0.5,'Devis d''implantation des écrans'!G46,'Devis d''implantation des écrans'!G46*0.5/'Devis d''implantation des écrans'!G$14)","v":0},{"$f":"IF('Devis d''implantation des écrans'!H$14<=0.5,'Devis d''implantation des écrans'!H46,'Devis d''implantation des écrans'!H46*0.5/'Devis d''implantation des écrans'!H$14)","v":0},{"$f":"IF('Devis d''implantation des écrans'!I$14<=0.5,'Devis d''implantation des écrans'!I46,'Devis d''implantation des écrans'!I46*0.5/'Devis d''implantation des écrans'!I$14)","v":0},{"$f":"IF('Devis d''implantation des écrans'!J$14<=0.5,'Devis d''implantation des écrans'!J46,'Devis d''implantation des écrans'!J46*0.5/'Devis d''implantation des écrans'!J$14)","v":0},{"$f":"IF('Devis d''implantation des écrans'!K$14<=0.5,'Devis d''implantation des écrans'!K46,'Devis d''implantation des écrans'!K46*0.5/'Devis d''implantation des écrans'!K$14)","v":0},{"$f":"IF('Devis d''implantation des écrans'!L$14<=0.5,'Devis d''implantation des écrans'!L46,'Devis d''implantation des écrans'!L46*0.5/'Devis d''implantation des écrans'!L$14)","v":0},null,{"$f":"IF(Questionnaire!H114=\"Oui\",1,(IF(Questionnaire!H114=\"Yes\",1,0)))","v":0},{"$f":"IF(Questionnaire!I114=\"Oui\",1,(IF(Questionnaire!I114=\"Yes\",1,0)))","v":0},{"$f":"IF(Questionnaire!J114=\"Oui\",1,(IF(Questionnaire!J114=\"Yes\",1,0)))","v":0},{"$f":"IF(Questionnaire!K114=\"Oui\",1,(IF(Questionnaire!K114=\"Yes\",1,0)))","v":0},{"$f":"IF(Questionnaire!L114=\"Oui\",1,(IF(Questionnaire!L114=\"Yes\",1,0)))","v":0},{"$f":"IF(Questionnaire!M114=\"Oui\",1,(IF(Questionnaire!M114=\"Yes\",1,0)))","v":0},{"$f":"IF(Questionnaire!N114=\"Oui\",1,(IF(Questionnaire!N114=\"Yes\",1,0)))","v":0},{"$f":"(N21*F21+G21*O21+P21*H21+Q21*I21+R21*J21+K21*S21+T21*L21)","v":0}]
["Nombre total de végétaux calcul biomasse",null,null,{"$f":"SUM(D17:D21)","v":0},null,{"$f":"SUM(F17:F21)","v":0},{"$f":"SUM(G17:G21)","v":0},0,0,0,0,0]
[]
[null,"Nombre de m3 à maturité","Valeur si le bois est vendu pour le sciage",null,"Valeur si le bois est vendu pour le déroulage",null,"Valeur si le bois est vendu pour du bois de chauffage",null,"Valeur de la biomasse brut (pâte ou autres destinations)",null,"Valeur si bois vendu pour sciage + pâte"]
[null,null,null,null,null,null,null,null,null,null,null,null,"Site pour calculé facteur de conversion",null,null,"https://www.foretprivee.ca/bibliotheque/outils/nos-facteurs-de-conversion-et-mesures/"]
[null,null,null,null,null,null,null,null,null,null,null,null,"Équivalence     http://www.spfbsl.com/mise-en-marche-collective/facteurs-dequivalence.html"]
[null,null," /m3",null," /m3",null,"Corde de 8'",null,"$/TMV",null,null,null,"1000PMP","4,6 m3 solide","4,6 TMV","2 TMA"]
["Épinettes, Pins ou Thuyas",{"$f":"H58*U17","v":0},{"$f":"Paramètres!F82","v":52},{"$f":"IF($B$49=A43,C28*I58*U17,0)","v":0},null,null,null,null,{"$f":"Paramètres!I82","v":30},{"$f":"IF($B$49=$A$46,I28*U31*H58*U17,IF(OR($B$49=$A$43,$B$49=$A$45),(H58-I58)*U17*I28*U31*L58,0))","v":0},{"$f":"IF($B$43=B49,((C28*I58*U17)+((H58*L58-I58)*U17*U31*I28)),0)","v":0},null,"MPMP","m3 solide","TMV","TMA","m3 apparent","TIV","corde 4 X4 X8","corde 8 x 4 x 8","1m3 à TMV","1 m3 à une corde de 4 X * X 8"]
["Peupliers hybrides",{"$f":"H53*U18","v":0},{"$f":"Paramètres!F83","v":41},{"$f":"IF($B$48=A43,C29*I53*U18,0)","v":0},{"$f":"Paramètres!G83","v":65},{"$f":"IF($B$48=A45,E29*U18*I53,0)","v":0},null,null,{"$f":"Paramètres!I83","v":32},{"$f":"IF($B$48=$A$46,I29*U18*H53*U29,IF(OR($B$48=$A$43,$B$48=$A$45),(H53-I53)*U18*I29*U29*L53,0))","v":0},{"$f":"IF($B$43=B48,((C29*I53*U18)+((H53*L53-I53)*U18*U29*I29)),0)","v":0},"Peuplier",1,5.5,5.5,2.5,8.25,6.05,2.2759999999999998,1.3080000000000001,{"$f":"1*O29/N29","v":1}]
["Feuillus nobles",{"$f":"H52*U19","v":0},{"$f":"Paramètres!F84","v":61},{"$f":"IF($B$50=A43,C30*I52*U19,0)","v":0},{"$f":"Paramètres!G84","v":145},{"$f":"IF($B$50=A45,E30*U19*I52,0)","v":0},{"$f":"Paramètres!H84","v":225},{"$f":"IF($B$50=$A$44,G30*U19*H52*$V$30*L52,0)","v":0},{"$f":"Paramètres!I84","v":40},{"$f":"IF($B$50=$A$46,I30*U19*H52*U30,IF(OR($B$50=$A43,$B$50=$A$45),(H52-I52)*U19*I30*U30*L52,0))","v":0},{"$f":"IF($B$43=B50,((C30*I52*U19)+((H52*L52-I52)*U19*U30*I30)),0)","v":0},"Feuillus",1,5.2,5.9089999999999998,2.9380000000000002,7.8,6.5,2.1520000000000001,1.2210000000000001,{"$f":"1*O30/N30","v":1.1363461538461537},0.23499999999999999]
["Saules hybrides (tonne M.S.)",{"$f":"G40","v":0},null,null,null,null,null,null,{"$f":"Paramètres!I85","v":32},{"$f":"IF($B$51=A46,U21/E40*0.87*I31,0)","v":0},null,"Résineux",1,5.5,4.774,2.5,8.25,5.2519999999999998,2.2759999999999998,1.2649999999999999,{"$f":"1*O31/N31","v":0.86799999999999999}]
["Total",{"$f":"SUM(B29:B30)","v":0},193,{"$f":"SUM(D28:D30)","v":0},null,{"$f":"SUM(F29:F30)","v":0},null,{"$f":"SUM(H29:H30)","v":0},null,{"$f":"SUM(J28:J31)","v":0},{"$f":"SUM(K28:K31)","v":0},"Site pour calculé facteur de conversion",null,null,"https://www.foretprivee.ca/bibliotheque/outils/nos-facteurs-de-conversion-et-mesures/"]
[null,null,{"$f":"C30*I52*U21","v":0},null,null,null,null,null,"Grand total",{"$f":"D32+F32+H32+J32+K32","v":0},null,"Références: Michel  Labrecque communication personnelle voir CEPAF/colloque/conférence BR"]
[]
["Essences","Abbréviation",{"$f":"A16","v":"Nombre d'arbres pour calcul biomasse"},null,"Nombre d'arbres requis pour faire 1 m3",null,"Nombre de m3 à maturité",null,null,{"$f":"300/320","v":0.9375},{"$f":"+J35*3.7*3.27*3.27","v":37.090996875000002}]
["Épinettes, Pins ou Thuyas","CON",{"$f":"D17","v":0},null,{"$f":"1/H58","v":1.0900849530861578},null,{"$f":"C36/E36","v":0}]
["Peupliers hybrides",{"$f":"'Devis d''implantation des écrans'!C43","v":"PEH"},{"$f":"D18","v":0},null,{"$f":"1/H53","v":0.8964197647190707},null,{"$f":"C37/E37","v":0}]
["Feuillus nobles",{"$f":"'Devis d''implantation des écrans'!C44","v":"FNO"},{"$f":"D19","v":0},null,{"$f":"1/H52","v":1.1479783381430329},null,{"$f":"C38/E38","v":0},null,null,null,null,null,null,null,null,null,null,null,null,1]
["Arbustes","ARB",{"$f":"D20","v":0},null,25,null,{"$f":"C39/E39","v":0}]
["Saules hybrides","SAH",{"$f":"D21","v":0},null,25,null,{"$f":"C40/E40","v":0}]
[]
["Type de bois",null,null,"Saules","Rendement tonne M.S./ha/an ",null,"Espacement entre les tiges",null,"Espacement entre les rangs",null,"Tiges / tonne"]
[{"$f":"IF(Langue!$A$200 = \"FR\",Dictionnaire!A291,Dictionnaire!B291)","v":"Sciage"},{"$f":"IF(Langue!$A$200 = \"FR\",Dictionnaire!A295,Dictionnaire!B295)","v":"Sciage et pâte"},null,null,18,null,0.5,null,3,null,{"$f":"10000/I43/(G43/2)/E43","v":740.74074074074076}]
[{"$f":"IF(Langue!$A$200 = \"FR\",Dictionnaire!A293,Dictionnaire!B293)","v":"Bois de chauffage"},null,null,null,18,null,0.6,null,3,null,617.28395061728395]
[{"$f":"IF(Langue!$A$200 = \"FR\",Dictionnaire!A292,Dictionnaire!B292)","v":"Déroulage"},null,null,null,18,null,null,null,null,null,{"$error":"#DIV/0!"}]
[{"$f":"IF(Langue!$A$200 = \"FR\",Dictionnaire!A294,Dictionnaire!B294)","v":"Pâte ou biomasse"},null,null,null,15,null,0.5,null,3,null,888.88888888888891]
["Choix",null,null,null,15,null,0.6,null,3,null,740.74074074074076]
["PEH",{"$f":"Questionnaire!F111","v":"Sciage"},null,null,15,null,null,null,null,null,{"$error":"#DIV/0!"}]
["CON",{"$f":"Questionnaire!F112","v":"Sciage"}]
["FNO",{"$f":"Questionnaire!F113","v":"Sciage"}]
["SAH",{"$f":"Questionnaire!F114","v":"Pâte ou biomasse"},null,null,null,null,null,"Vol marchard arbre entier (m3)","Bille seulement (bille de 12 pieds) (% sciage en m3)",null,"% deroulage","% bois utilisable"]
["FNO",null,null,null,null,null,null,{"$f":"Q72","v":0.87109657627999992},{"$f":"((O78^2 +O79^2)/2*O80*0.07854)*0.001","v":0.36590215200000004},"m3/arbre","\\Prixmoyenboishaiebriseodeur.xls",0.9]
["Dans le cas des PEH, on relate les mesures de volume obtenus en haies brise-vent à La Pocatière, (24 ans après plantation)",null,null,null,null,null,null,{"$f":"R76","v":1.1155488080000002},{"$f":"((Q78^2 +Q79^2)/2*Q80*0.07854)*0.001","v":0.43215849599999995},"m3/arbre","\\rendements brise-vent.xls",0.9]
[null,null,null,null,null,null,null,null,null,null,"\\84_Cubage_bois_abattus_SB011999.pdf"]
[null,null,null,null,null,null,null,null,null,null,"\\boischauffageMonteregie.pdf"]
[]
[]
["CON",null,null,null,null,null,null,{"$f":"Y71","v":0.9173596949199998},{"$f":"((P78^2 + P79^2)/2*P80*0.07854)*0.001","v":0.43215849599999995},null,null,0.9]
[]
[]
[null,null,null,null,null,null,null,null,null,null,null,null,null,"Feuille des volumes à utiliser"]
[]
[null,"formule pour tige",{"$f":"(3.1416*3*((0.4+0.36)/2)*((0.4+0.36)/2))/4","v":0.34023527999999997}]
[null,null,null,null,null,null,"volume d'un cylindre (rayon=12,5 cm), hauteur 15 m",null,{"$f":"3.1416*0.125*0.125*18","v":0.883575},null,null,null,null,null,null,"Selon table de Perron",null,null,null,null,"Résineux","40 ans"]
[null,null,null,null,null,null,null,null,null,null,null,null,null,"FNO","H",36,38,40,42,null,null,"H",36,38,40,42]
[null,null,null,null,null,null,null,null,null,null,null,null,null,"ERS",18,{"$f":"(7.5092 -2.3793097*$O66+0.0336075*P$65*P$65*$O66)*0.001","v":0.74867738540000006},{"$f":"(7.5092 -2.3793097*$O66+0.0336075*Q$65*Q$65*$O66)*0.001","v":0.83820776539999997},{"$f":"(7.5092 -2.3793097*$O66+0.0336075*R$65*R$65*$O66)*0.001","v":0.93257762540000011},{"$f":"(7.5092 -2.3793097*$O66+0.0336075*S$65*S$65*$O66)*0.001","v":1.0317869653999998},null,"EPB",18,{"$f":"(-24.9889 + 4.90312*W$65-0.21366*W$65*W$65-4.6912003*$V66+0.33143*$V66*W$65+0.0313*W$65*W$65*$V66)*0.001","v":0.73511149460000003},{"$f":"(-24.9889 + 4.90312*X$65-0.21366*X$65*X$65-4.6912003*$V66+0.33143*$V66*X65+0.0313*X65*X65*$V66)*0.001","v":0.8086107346000001},{"$f":"(-24.9889 + 4.90312*Y$65-0.21366*Y$65*Y$65-4.6912003*$V66+0.33143*$V66*Y65+0.0313*Y65*Y65*$V66)*0.001","v":0.88490789459999997},{"$f":"(-24.9889 + 4.90312*Z$65-0.21366*Z$65*Z$65-4.6912003*$V66+0.33143*$V66*Z65+0.0313*Z65*Z65*$V66)*0.001","v":0.96400297460000006}]
[null,null,null,null,null,null,null,null,null,null,null,null,null,"CHR",18,{"$f":"(-7.6298 - 0.0911019*$O67*$O67 +0.035163*P$65*P$65*$O67)*0.001","v":0.78313564839999994},{"$f":"(-7.6298 - 0.0911019*$O67*$O67 +0.035163*Q$65*Q$65*$O67)*0.001","v":0.87680988039999996},{"$f":"(-7.6298 - 0.0911019*$O67*$O67 +0.035163*R$65*R$65*$O67)*0.001","v":0.97554758440000011},{"$f":"(-7.6298 - 0.0911019*$O67*$O67 +0.035163*S$65*S$65*$O67)*0.001","v":1.0793487604000003},null,"EPR",18,{"$f":"(1.5134-4.3801899*$V67+0.36715*$V67*W$65+0.02595*W$65*W$65*$V67)*0.001","v":0.76594478179999992},{"$f":"(1.5134-4.3801899*$V67+0.36715*$V67*X$65+0.02595*X$65*X$65*$V67)*0.001","v":0.84829298180000001},{"$f":"(1.5134-4.3801899*$V67+0.36715*$V67*Y$65+0.02595*Y$65*Y$65*$V67)*0.001","v":0.93437798180000009},{"$f":"(1.5134-4.3801899*$V67+0.36715*$V67*Z$65+0.02595*Z$65*Z$65*$V67)*0.001","v":1.0241997817999999}]
[null,null,null,null,null,null,null,null,null,null,null,null,null,"FRP",18,{"$f":"(0.4784-0.52712*P$65+0.101104*P$65*P$65-0.27414*P$65*$O68+0.03885*P$65*P$65*$O68)*0.001","v":0.84118294400000004},{"$f":"(0.4784-0.52712*Q$65+0.101104*Q$65*Q$65-0.27414*Q$65*$O68+0.03885*Q$65*Q$65*$O68)*0.001","v":0.94871945600000007},{"$f":"(0.4784-0.52712*R$65+0.101104*R$65*R$65-0.27414*R$65*$O68+0.03885*R$65*R$65*$O68)*0.001","v":1.0626592000000001},{"$f":"(0.4784-0.52712*S$65+0.101104*S$65*S$65-0.27414*S$65*$O68+0.03885*S$65*S$65*$O68)*0.001","v":1.183002176},null,"MEL",18,{"$f":"(-9.7692+0.032166*W$65*W$65*$V68)*0.001","v":0.7405992480000001},{"$f":"(-9.7692+0.032166*X$65*X$65*$V68)*0.001","v":0.82628947200000002},{"$f":"(-9.7692+0.032166*Y$65*Y$65*$V68)*0.001","v":0.91661160000000008},{"$f":"(-9.7692+0.032166*Z$65*Z$65*$V68)*0.001","v":1.0115656320000002}]
[null,null,null,null,null,null,null,null,null,null,null,null,null,"TIL",18,{"$f":"(-2.1279802*$O69+0.0339905*P$65*P$65*$O69)*0.001","v":0.7546267404},{"$f":"(-2.1279802*$O69+0.0339905*Q$65*Q$65*$O69)*0.001","v":0.84517743240000009},{"$f":"(-2.1279802*$O69+0.0339905*R$65*R$65*$O69)*0.001","v":0.94062275639999993},{"$f":"(-2.1279802*$O69+0.0339905*S$65*S$65*$O69)*0.001","v":1.0409627123999998},null,"PIB",18,{"$f":"(-5.1688604*$V69+0.489927*$V69*W$65+0.0238181*W$65*W$65*$V69)*0.001","v":0.78006184560000003},{"$f":"(-5.1688604*$V69+0.489927*$V69*X$65+0.0238181*X$65*X$65*$V69)*0.001","v":0.86115063599999986},{"$f":"(-5.1688604*$V69+0.489927*$V69*Y$65+0.0238181*Y$65*Y$65*$V69)*0.001","v":0.94566923279999993},{"$f":"(-5.1688604*$V69+0.489927*$V69*Z$65+0.0238181*Z$65*Z$65*$V69)*0.001","v":1.033617636}]
[null,null,null,null,null,null,null,null,null,null,null,null,null,"ORM",18,{"$f":"(0.7829+0.132188*$O70-0.271184*$O70*P$65+0.0395851*$O70*P$65*P$65)*0.001","v":0.75087626479999992},{"$f":"(0.7829+0.132188*$O70-0.271184*$O70*Q$65+0.0395851*$O70*Q$65*Q$65)*0.001","v":0.84656834720000007},{"$f":"(0.7829+0.132188*$O70-0.271184*$O70*R$65+0.0395851*$O70*R$65*R$65)*0.001","v":0.94796068399999978},{"$f":"(0.7829+0.132188*$O70-0.271184*$O70*S$65+0.0395851*$O70*S$65*S$65)*0.001","v":1.0550532751999999},null,"PIR",18,{"$f":"(-0.04629*W$65*W$65-2.1198797*$V70+0.19273*$V70*W$65+0.03051*W$65*W$65*$V70)*0.001","v":0.73847664539999991},{"$f":"(-0.04629*X$65*X$65-2.1198797*$V70+0.19273*$V70*X$65+0.03051*X$65*X$65*$V70)*0.001","v":0.81984264539999996},{"$f":"(-0.04629*Y$65*Y$65-2.1198797*$V70+0.19273*$V70*Y$65+0.03051*Y$65*Y$65*$V70)*0.001","v":0.90523176539999983},{"$f":"(-0.04629*Z$65*Z$65-2.1198797*$V70+0.19273*$V70*Z$65+0.03051*Z$65*Z$65*$V70)*0.001","v":0.99464400539999998}]
[null,null,null,null,null,null,null,null,null,null,null,null,null,"CET",18,{"$f":"(-1.8224401*$O71+0.034424*P$65*P$65*$O71)*0.001","v":0.77023915020000022},{"$f":"(-1.8224401*$O71+0.034424*Q$65*Q$65*$O71)*0.001","v":0.86194468620000009},{"$f":"(-1.8224401*$O71+0.034424*R$65*R$65*$O71)*0.001","v":0.95860727820000013},{"$f":"(-1.8224401*$O71+0.034424*S$65*S$65*$O71)*0.001","v":1.0602269262000001},null,null,"moyenne",{"$f":"AVERAGE(W66:W70)","v":0.75203880308000004},{"$f":"AVERAGE(X66:X70)","v":0.83283729395999995},{"$f":"AVERAGE(Y66:Y70)","v":0.9173596949199998},{"$f":"AVERAGE(Z66:Z70)","v":1.00560600596}]
[null,null,null,null,null,null,null,null,null,null,null,null,null,null,"Moyenne",{"$f":"AVERAGE(P66:P70)","v":0.77569979659999999},{"$f":"AVERAGE(Q66:Q70)","v":0.87109657627999992},{"$f":"AVERAGE(R66:R70)","v":0.97187357003999997},{"$f":"AVERAGE(S66:S70)","v":1.07803077788}]
[]
[null,null,null,null,null,null,null,null,null,null,null,null,null,"Calcul volume de la première bille"]
[null,null,null,null,null,null,null,null,null,null,null,null,null,null,"H",36,38,40,42]
[null,null,null,null,null,null,null,null,null,null,null,null,null,"PET",20,{"$f":"( -1.5881596*$O76+0.0358535*P75*P75*$O76)*0.001","v":0.89755952800000005},{"$f":"( -1.5881596*$O76+0.0358535*Q75*Q75*$O76)*0.001","v":1.0036858880000004},{"$f":"( -1.5881596*$O76+0.0358535*R75*R75*$O76)*0.001","v":1.1155488080000002},{"$f":"( -1.5881596*$O76+0.0358535*S75*S75*$O76)*0.001","v":1.2331482880000004}]
[null,null,null,null,null,null,null,null,null,null,null,null,null,null,"FNO","CON","PEH"]
[null,null,null,null,null,null,null,null,null,null,null,null,null,"DIA fin bout",34,36,36]
[null,null,null,null,null,null,null,null,null,null,null,null,null,"DIA début",36,40,40]
[null,null,null,null,null,null,null,null,null,null,null,null,null,"longueur",3.8,3.8,3.8]
[null,null,null,null,null,null,null,null,null,null,null,null,null,"pieds",{"$f":"O80*3.281","v":12.4678}]
[]
[]
[]
[]
[]
[]
[]
[]
[]
[]
[]
["Améliorations",null,null,null,"Marge actualisée",null,"Marge actualisée accumulée"]
[]
["total cumulatif à l'an"]
[1,{"$f":"IF(Questionnaire!C$114=TRUE,(0*$J$31*Questionnaire!$G$120),0)","v":0},null,null,{"$f":"B96/POWER(1+Paramètres!$AF$14,A96)","v":0}]
[2,{"$f":"IF(Questionnaire!C$114=TRUE,(0*$J$31*Questionnaire!$G$120),0)","v":0},null,null,{"$f":"B97/POWER(1+Paramètres!$AF$14,A97)","v":0}]
[3,{"$f":"IF(Questionnaire!C$114=TRUE,(3*$J$31*Questionnaire!$G$120),0)","v":0},null,null,{"$f":"B98/POWER(1+Paramètres!$AF$14,A98)","v":0}]
[4,{"$f":"IF(Questionnaire!C$114=TRUE,(0*$J$31*Questionnaire!$G$120),0)","v":0},null,null,{"$f":"B99/POWER(1+Paramètres!$AF$14,A99)","v":0}]
[5,{"$f":"IF(Questionnaire!C$114=TRUE,(0*$J$31*Questionnaire!$G$120),0)","v":0},{"$f":"SUM(B96:B100)","v":0},null,{"$f":"B100/POWER(1+Paramètres!$AF$14,A100)","v":0},{"$f":"SUM(E96:E100)","v":0}]
[6,{"$f":"IF(Questionnaire!C$114=TRUE,(3*$J$31*Questionnaire!$G$120),0)","v":0},null,null,{"$f":"B101/POWER(1+Paramètres!$AF$14,A101)","v":0}]
[7,{"$f":"IF(Questionnaire!C$114=TRUE,(0*$J$31*Questionnaire!$G$120),0)","v":0},null,null,{"$f":"B102/POWER(1+Paramètres!$AF$14,A102)","v":0}]
[8,{"$f":"IF(Questionnaire!C$114=TRUE,(0*$J$31*Questionnaire!$G$120),0)","v":0},null,null,{"$f":"B103/POWER(1+Paramètres!$AF$14,A103)","v":0}]
[9,{"$f":"IF(Questionnaire!C$114=TRUE,(3*$J$31*Questionnaire!$G$120),0)","v":0},null,null,{"$f":"B104/POWER(1+Paramètres!$AF$14,A104)","v":0}]
[10,{"$f":"IF(Questionnaire!C$114=TRUE,(0*$J$31*Questionnaire!$G$120),0)","v":0},{"$f":"SUM(B101:B105)","v":0},null,{"$f":"B105/POWER(1+Paramètres!$AF$14,A105)","v":0},{"$f":"SUM(E101:E105)","v":0},{"$f":"SUM(E96:E105)","v":0}]
[11,{"$f":"IF(Questionnaire!C$114=TRUE,(0*$J$31*Questionnaire!$G$120),0)","v":0},null,null,{"$f":"B106/POWER(1+Paramètres!$AF$14,A106)","v":0}]
[12,{"$f":"IF(Questionnaire!C$114=TRUE,(3*$J$31*Questionnaire!$G$120),0)","v":0},null,null,{"$f":"B107/POWER(1+Paramètres!$AF$14,A107)","v":0}]
[13,{"$f":"IF(Questionnaire!C$114=TRUE,(0*$J$31*Questionnaire!$G$120),0)","v":0},null,null,{"$f":"B108/POWER(1+Paramètres!$AF$14,A108)","v":0}]
[14,{"$f":"IF(Questionnaire!C$114=TRUE,(0*$J$31*Questionnaire!$G$120),0)","v":0},null,null,{"$f":"B109/POWER(1+Paramètres!$AF$14,A109)","v":0}]
[15,{"$f":"IF(Questionnaire!C$114=TRUE,(3*$J$31*Questionnaire!$G$120),0)","v":0},null,null,{"$f":"B110/POWER(1+Paramètres!$AF$14,A110)","v":0}]
[16,{"$f":"IF(Questionnaire!C$114=TRUE,(0*$J$31*Questionnaire!$G$120),0)","v":0},null,null,{"$f":"B111/POWER(1+Paramètres!$AF$14,A111)","v":0}]
[17,{"$f":"IF(Questionnaire!C$114=TRUE,(0*$J$31*Questionnaire!$G$120),0)","v":0},null,null,{"$f":"B112/POWER(1+Paramètres!$AF$14,A112)","v":0}]
[18,{"$f":"IF(Questionnaire!C$114=TRUE,(3*$J$31*Questionnaire!$G$120),0)","v":0},null,null,{"$f":"B113/POWER(1+Paramètres!$AF$14,A113)","v":0}]
[19,{"$f":"IF(Questionnaire!C$114=TRUE,(0*$J$31*Questionnaire!$G$120),0)","v":0},null,null,{"$f":"B114/POWER(1+Paramètres!$AF$14,A114)","v":0}]
[20,{"$f":"IF(Questionnaire!$C$114=TRUE,(0*$J$31*Questionnaire!$G$120),0)+IF(Questionnaire!$C$111=TRUE,($D$29+$F$29+$H$29+J29)*Questionnaire!$G$117,0)","v":0},{"$f":"SUM(B106:B115)","v":0},null,{"$f":"B115/POWER(1+Paramètres!$AF$14,A115)","v":0},{"$f":"SUM(E106:E115)","v":0},{"$f":"SUM(E96:E115)","v":0}]
[21,{"$f":"IF(Questionnaire!$C$114=TRUE,(3*$J$31*Questionnaire!$G$120),0)","v":0},null,null,{"$f":"B116/POWER(1+Paramètres!$AF$14,A116)","v":0}]
[22,{"$f":"IF(Questionnaire!$C$114=TRUE,(0*$J$31*Questionnaire!$G$120),0)","v":0},null,null,{"$f":"B117/POWER(1+Paramètres!$AF$14,A117)","v":0}]
[23,{"$f":"IF(Questionnaire!$C$114=TRUE,(0*$J$31*Questionnaire!$G$120),0)","v":0},null,null,{"$f":"B118/POWER(1+Paramètres!$AF$14,A118)","v":0}]
[24,{"$f":"IF(Questionnaire!$C$114=TRUE,(3*$J$31*Questionnaire!$G$120),0)","v":0},null,null,{"$f":"B119/POWER(1+Paramètres!$AF$14,A119)","v":0}]
[25,{"$f":"IF(Questionnaire!$C$114=TRUE,(0*$J$31*Questionnaire!$G$120),0)","v":0},null,null,{"$f":"B120/POWER(1+Paramètres!$AF$14,A120)","v":0}]
[26,{"$f":"IF(Questionnaire!$C$114=TRUE,(0*$J$31*Questionnaire!$G$120),0)","v":0},null,null,{"$f":"B121/POWER(1+Paramètres!$AF$14,A121)","v":0}]
[27,{"$f":"IF(Questionnaire!$C$114=TRUE,(3*$J$31*Questionnaire!$G$120),0)","v":0},null,null,{"$f":"B122/POWER(1+Paramètres!$AF$14,A122)","v":0}]
[28,{"$f":"IF(Questionnaire!$C$114=TRUE,(0*$J$31*Questionnaire!$G$120),0)","v":0},null,null,{"$f":"B123/POWER(1+Paramètres!$AF$14,A123)","v":0}]
[29,{"$f":"IF(Questionnaire!$C$114=TRUE,(0*$J$31*Questionnaire!$G$120),0)","v":0},null,null,{"$f":"B124/POWER(1+Paramètres!$AF$14,A124)","v":0}]
[30,{"$f":"IF(Questionnaire!$C$114=TRUE,(3*$J$31*Questionnaire!$G$120),0)","v":0},{"$f":"SUM(B116:B125)","v":0},null,{"$f":"B125/POWER(1+Paramètres!$AF$14,A125)","v":0}]
[31,{"$f":"IF(Questionnaire!$C$114=TRUE,(0*$J$31*Questionnaire!$G$120),0)","v":0},null,null,{"$f":"B126/POWER(1+Paramètres!$AF$14,A126)","v":0}]
[32,{"$f":"IF(Questionnaire!$C$114=TRUE,(0*$J$31*Questionnaire!$G$120),0)","v":0},null,null,{"$f":"B127/POWER(1+Paramètres!$AF$14,A127)","v":0}]
[33,{"$f":"IF(Questionnaire!$C$114=TRUE,(3*$J$31*Questionnaire!$G$120),0)","v":0},null,null,{"$f":"B128/POWER(1+Paramètres!$AF$14,A128)","v":0}]
[34,{"$f":"IF(Questionnaire!$C$114=TRUE,(0*$J$31*Questionnaire!$G$120),0)","v":0},null,null,{"$f":"B129/POWER(1+Paramètres!$AF$14,A129)","v":0}]
[35,{"$f":"IF(Questionnaire!$C$114=TRUE,(0*$J$31*Questionnaire!$G$120),0)","v":0},null,null,{"$f":"B130/POWER(1+Paramètres!$AF$14,A130)","v":0}]
[36,{"$f":"IF(Questionnaire!$C$114=TRUE,(3*$J$31*Questionnaire!$G$120),0)","v":0},null,null,{"$f":"B131/POWER(1+Paramètres!$AF$14,A131)","v":0}]
[37,{"$f":"IF(Questionnaire!$C$114=TRUE,(0*$J$31*Questionnaire!$G$120),0)","v":0},null,null,{"$f":"B132/POWER(1+Paramètres!$AF$14,A132)","v":0}]
[38,{"$f":"IF(Questionnaire!$C$114=TRUE,(0*$J$31*Questionnaire!$G$120),0)","v":0},null,null,{"$f":"B133/POWER(1+Paramètres!$AF$14,A133)","v":0}]
[39,{"$f":"IF(Questionnaire!$C$114=TRUE,(3*$J$31*Questionnaire!$G$120),0)","v":0},null,null,{"$f":"B134/POWER(1+Paramètres!$AF$14,A134)","v":0}]
[40,{"$f":"(IF(Questionnaire!$C$114=TRUE,(0*$J$31*Questionnaire!$G$120),0)+IF(Questionnaire!$C$113=TRUE,($D$30+$F$30+$H$30+J30)*Questionnaire!$G$119,0)+IF(Questionnaire!$C$112=TRUE,D28+J28,0)*Questionnaire!$G$118)","v":0},{"$f":"SUM(B116:B135)","v":0},null,{"$f":"B135/POWER(1+Paramètres!$AF$14,A135)","v":0},{"$f":"SUM(E116:E135)","v":0},{"$f":"SUM(E96:E135)","v":0}]
[null,null,{"$f":"SUM(C96:C135)","v":0}]

{"sheet":"Calcul du rendement en petits f","index":21,"n_rows":139,"n_cols":14,"rows_kept":139,"cut":false,"hidden":false,"merged":[[96,6,97,6],[96,0,97,2],[96,4,97,5],[98,0,98,1],[98,4,98,5],[17,1,17,2],[17,3,17,4],[17,5,17,6],[17,7,17,8],[15,1,16,2],[15,3,16,4],[15,5,16,6],[15,7,16,8],[0,0,0,9],[3,1,5,1],[3,2,5,3],[3,6,5,6],[3,7,5,7],[3,4,5,5],[3,8,5,8],[6,2,6,3],[6,4,6,5],[7,2,7,3],[7,4,7,5],[8,2,8,3],[8,4,8,5],[12,2,12,3],[12,4,12,5],[13,2,13,3],[13,4,13,5],[9,2,9,3],[9,4,9,5],[10,2,10,3],[10,4,10,5],[11,2,11,3],[11,4,11,5]]}
[]
[]
[]
[null,"Période","Améliorations",null,"Détériorations",null,"Marge","Marge actualisée ","Marge actualisée accumulée"]
[null,null,null,null,null,null,null,null,null,null,null,275,"250 à 300","2 à 4 "]
[null,null,null,null,null,null,null,null,null,null,null,625,"550 à 700","2 à 4"]
[null,"0-5 ans",{"$f":"C104","v":0},null,0,null,{"$f":"C7+E7","v":0},{"$f":"F104","v":0},{"$f":"F104","v":0},null,null,400,"350 à 450","2 à 4"]
[null,null,null,null,null,null,null,null,null,null,null,125,"100 à 150","2 à 4"]
[null,"5-10 ans",{"$f":"C109","v":0},null,0,null,{"$f":"C9+E9","v":0},{"$f":"F109","v":0},{"$f":"G109","v":0},null,null,125,"100 à 150","2 à 4"]
[null,null,null,null,null,null,null,null,null,null,null,150,"100 à 200","2 à 4"]
[null,"10-20 ans",{"$f":"C119","v":0},null,0,null,{"$f":"C11+E11","v":0},{"$f":"F119","v":0},{"$f":"G119","v":0},null,null,200,"150 à 250","2 à 4"]
[null,null,null,null,null,null,null,null,null,null,null,{"$f":"AVERAGE(L5:L11)","v":271.42857142857144}]
[null,"20-40 ans",{"$f":"C139","v":0},null,0,null,{"$f":"C13+E13","v":0},{"$f":"F139","v":0},{"$f":"G139","v":0}]
[null,null,null,null,null,null,null,null,null,null,null,{"$f":"L12/25","v":10.857142857142858}]
[]
[null,"Revenus liés aux PFNL de 0 à 5 ans",null,"Revenus liés aux PFNL de 5 à 10 ans",null,"Revenus liés aux PFNL de 10 à 20 ans",null,"Revenus liés aux PFNL de 20 à 40 ans"]
[]
[null,{"$f":"$D$22*'Devis d''implantation des écrans'!$D$45*$D$24*$D$20*3","v":0},null,{"$f":"$D$22*'Devis d''implantation des écrans'!$D$45*$D$24*$D$20*5","v":0},null,{"$f":"$D$22*'Devis d''implantation des écrans'!$D$45*$D$24*$D$20*10","v":0},null,{"$f":"$D$22*'Devis d''implantation des écrans'!$D$45*$D$24*$D$20*20","v":0}]
[]
["Pourcentage de profit net anticipé ?",null,null,{"$f":"Questionnaire!F133","v":0.2},null,"Conservateur sans petits fruits, réaliste avec petits fruits,4 kg/tige, $800/tonne et 5% de profit net; optimiste avec petits fruits, 6 kg/, $1000/tonne et 10% de profit net"]
[]
["Récolte par tige",null,null,{"$f":"Questionnaire!F129","v":1.25},"kg"]
[]
["Prix la tonne",null,null,{"$f":"Questionnaire!F131","v":0.8},"kg"]
[]
["Pourcentage en arbustes fruitier",null,null,{"$f":"Questionnaire!H124","v":0}]
[]
["Les fruits seront récoltés",null,null,{"$f":"Questionnaire!F126","v":"Non"},{"$f":"IF(OR(D28=\"Oui\",D28=\"Yes\"),1,0)","v":0},"Facteur égal à 0 s'il n'y a pas de récolte et égal à 1 s'il y a une récolte"]
[]
[]
[]
[]
[]
[]
[]
[]
[]
[]
[]
[]
[]
[]
[]
[]
[]
[]
[]
[]
[]
[]
[]
[]
[]
[]
[]
[]
[]
[]
[]
[]
[]
[]
[]
[]
[]
[]
[]
[]
[]
[]
[]
[]
[]
[]
[]
[]
[]
[]
[]
[]
[]
[]
[]
[]
[]
[]
[]
[]
[]
[]
[]
[]
[]
[]
[]
[]
["Améliorations",null,null,null,"Marge actualisée",null,"Marge actualisée accumulée"]
[]
["total cumulatif à l'an"]
[1,{"$f":"(0*$D$26*$E$28*$D$22*'Devis d''implantation des écrans'!$D$45*$D$24/1000*$D$20)","v":0},null,null,{"$f":"B100/POWER(1+Paramètres!$AF$14,A100)","v":0}]
[2,{"$f":"(0*$D$26*$E$28*$D$22*'Devis d''implantation des écrans'!$D$45*$D$24/1000*$D$20)","v":0},null,null,{"$f":"B101/POWER(1+Paramètres!$AF$14,A101)","v":0}]
[3,{"$f":"($D$26*$E$28*$D$22*'Devis d''implantation des écrans'!$D$45*$D$24*$D$20)","v":0},null,null,{"$f":"B102/POWER(1+Paramètres!$AF$14,A102)","v":0}]
[4,{"$f":"($D$26*$E$28*$D$22*'Devis d''implantation des écrans'!$D$45*$D$24*$D$20)","v":0},null,null,{"$f":"B103/POWER(1+Paramètres!$AF$14,A103)","v":0}]
[5,{"$f":"($D$26*$E$28*$D$22*'Devis d''implantation des écrans'!$D$45*$D$24*$D$20)","v":0},{"$f":"SUM(B100:B104)","v":0},null,{"$f":"B104/POWER(1+Paramètres!$AF$14,A104)","v":0},{"$f":"SUM(E100:E104)","v":0}]
[6,{"$f":"($D$26*$E$28*$D$22*'Devis d''implantation des écrans'!$D$45*$D$24*$D$20)","v":0},null,null,{"$f":"B105/POWER(1+Paramètres!$AF$14,A105)","v":0}]
[7,{"$f":"($D$26*$E$28*$D$22*'Devis d''implantation des écrans'!$D$45*$D$24*$D$20)","v":0},null,null,{"$f":"B106/POWER(1+Paramètres!$AF$14,A106)","v":0}]
[8,{"$f":"($D$26*$E$28*$D$22*'Devis d''implantation des écrans'!$D$45*$D$24*$D$20)","v":0},null,null,{"$f":"B107/POWER(1+Paramètres!$AF$14,A107)","v":0}]
[9,{"$f":"($D$26*$E$28*$D$22*'Devis d''implantation des écrans'!$D$45*$D$24*$D$20)","v":0},null,null,{"$f":"B108/POWER(1+Paramètres!$AF$14,A108)","v":0}]
[10,{"$f":"($D$26*$E$28*$D$22*'Devis d''implantation des écrans'!$D$45*$D$24*$D$20)","v":0},{"$f":"SUM(B105:B109)","v":0},null,{"$f":"B109/POWER(1+Paramètres!$AF$14,A109)","v":0},{"$f":"SUM(E105:E109)","v":0},{"$f":"SUM(E100:E109)","v":0}]
[11,{"$f":"($D$26*$E$28*$D$22*'Devis d''implantation des écrans'!$D$45*$D$24*$D$20)","v":0},null,null,{"$f":"B110/POWER(1+Paramètres!$AF$14,A110)","v":0}]
[12,{"$f":"($D$26*$E$28*$D$22*'Devis d''implantation des écrans'!$D$45*$D$24*$D$20)","v":0},null,null,{"$f":"B111/POWER(1+Paramètres!$AF$14,A111)","v":0}]
[13,{"$f":"($D$26*$E$28*$D$22*'Devis d''implantation des écrans'!$D$45*$D$24*$D$20)","v":0},null,null,{"$f":"B112/POWER(1+Paramètres!$AF$14,A112)","v":0}]
[14,{"$f":"($D$26*$E$28*$D$22*'Devis d''implantation des écrans'!$D$45*$D$24*$D$20)","v":0},null,null,{"$f":"B113/POWER(1+Paramètres!$AF$14,A113)","v":0}]
[15,{"$f":"($D$26*$E$28*$D$22*'Devis d''implantation des écrans'!$D$45*$D$24*$D$20)","v":0},null,null,{"$f":"B114/POWER(1+Paramètres!$AF$14,A114)","v":0}]
[16,{"$f":"($D$26*$E$28*$D$22*'Devis d''implantation des écrans'!$D$45*$D$24*$D$20)","v":0},null,null,{"$f":"B115/POWER(1+Paramètres!$AF$14,A115)","v":0}]
[17,{"$f":"($D$26*$E$28*$D$22*'Devis d''implantation des écrans'!$D$45*$D$24*$D$20)","v":0},null,null,{"$f":"B116/POWER(1+Paramètres!$AF$14,A116)","v":0}]
[18,{"$f":"($D$26*$E$28*$D$22*'Devis d''implantation des écrans'!$D$45*$D$24*$D$20)","v":0},null,null,{"$f":"B117/POWER(1+Paramètres!$AF$14,A117)","v":0}]
[19,{"$f":"($D$26*$E$28*$D$22*'Devis d''implantation des écrans'!$D$45*$D$24*$D$20)","v":0},null,null,{"$f":"B118/POWER(1+Paramètres!$AF$14,A118)","v":0}]
[20,{"$f":"($D$26*$E$28*$D$22*'Devis d''implantation des écrans'!$D$45*$D$24*$D$20)","v":0},{"$f":"SUM(B110:B119)","v":0},null,{"$f":"B119/POWER(1+Paramètres!$AF$14,A119)","v":0},{"$f":"SUM(E110:E119)","v":0},{"$f":"SUM(E100:E119)","v":0}]
[21,{"$f":"($D$26*$E$28*$D$22*'Devis d''implantation des écrans'!$D$45*$D$24*$D$20)","v":0},null,null,{"$f":"B120/POWER(1+Paramètres!$AF$14,A120)","v":0}]
[22,{"$f":"($D$26*$E$28*$D$22*'Devis d''implantation des écrans'!$D$45*$D$24*$D$20)","v":0},null,null,{"$f":"B121/POWER(1+Paramètres!$AF$14,A121)","v":0}]
[23,{"$f":"($D$26*$E$28*$D$22*'Devis d''implantation des écrans'!$D$45*$D$24*$D$20)","v":0},null,null,{"$f":"B122/POWER(1+Paramètres!$AF$14,A122)","v":0}]
[24,{"$f":"($D$26*$E$28*$D$22*'Devis d''implantation des écrans'!$D$45*$D$24*$D$20)","v":0},null,null,{"$f":"B123/POWER(1+Paramètres!$AF$14,A123)","v":0}]
[25,{"$f":"($D$26*$E$28*$D$22*'Devis d''implantation des écrans'!$D$45*$D$24*$D$20)","v":0},null,null,{"$f":"B124/POWER(1+Paramètres!$AF$14,A124)","v":0}]
[26,{"$f":"($D$26*$E$28*$D$22*'Devis d''implantation des écrans'!$D$45*$D$24*$D$20)","v":0},null,null,{"$f":"B125/POWER(1+Paramètres!$AF$14,A125)","v":0}]
[27,{"$f":"($D$26*$E$28*$D$22*'Devis d''implantation des écrans'!$D$45*$D$24*$D$20)","v":0},null,null,{"$f":"B126/POWER(1+Paramètres!$AF$14,A126)","v":0}]
[28,{"$f":"($D$26*$E$28*$D$22*'Devis d''implantation des écrans'!$D$45*$D$24*$D$20)","v":0},null,null,{"$f":"B127/POWER(1+Paramètres!$AF$14,A127)","v":0}]
[29,{"$f":"($D$26*$E$28*$D$22*'Devis d''implantation des écrans'!$D$45*$D$24*$D$20)","v":0},null,null,{"$f":"B128/POWER(1+Paramètres!$AF$14,A128)","v":0}]
[30,{"$f":"($D$26*$E$28*$D$22*'Devis d''implantation des écrans'!$D$45*$D$24*$D$20)","v":0},null,null,{"$f":"B129/POWER(1+Paramètres!$AF$14,A129)","v":0}]
[31,{"$f":"($D$26*$E$28*$D$22*'Devis d''implantation des écrans'!$D$45*$D$24*$D$20)","v":0},null,null,{"$f":"B130/POWER(1+Paramètres!$AF$14,A130)","v":0}]
[32,{"$f":"($D$26*$E$28*$D$22*'Devis d''implantation des écrans'!$D$45*$D$24*$D$20)","v":0},null,null,{"$f":"B131/POWER(1+Paramètres!$AF$14,A131)","v":0}]
[33,{"$f":"($D$26*$E$28*$D$22*'Devis d''implantation des écrans'!$D$45*$D$24*$D$20)","v":0},null,null,{"$f":"B132/POWER(1+Paramètres!$AF$14,A132)","v":0}]
[34,{"$f":"($D$26*$E$28*$D$22*'Devis d''implantation des écrans'!$D$45*$D$24*$D$20)","v":0},null,null,{"$f":"B133/POWER(1+Paramètres!$AF$14,A133)","v":0}]
[35,{"$f":"($D$26*$E$28*$D$22*'Devis d''implantation des écrans'!$D$45*$D$24*$D$20)","v":0},null,null,{"$f":"B134/POWER(1+Paramètres!$AF$14,A134)","v":0}]
[36,{"$f":"($D$26*$E$28*$D$22*'Devis d''implantation des écrans'!$D$45*$D$24*$D$20)","v":0},null,null,{"$f":"B135/POWER(1+Paramètres!$AF$14,A135)","v":0}]
[37,{"$f":"($D$26*$E$28*$D$22*'Devis d''implantation des écrans'!$D$45*$D$24*$D$20)","v":0},null,null,{"$f":"B136/POWER(1+Paramètres!$AF$14,A136)","v":0}]
[38,{"$f":"($D$26*$E$28*$D$22*'Devis d''implantation des écrans'!$D$45*$D$24*$D$20)","v":0},null,null,{"$f":"B137/POWER(1+Paramètres!$AF$14,A137)","v":0}]
[39,{"$f":"($D$26*$E$28*$D$22*'Devis d''implantation des écrans'!$D$45*$D$24*$D$20)","v":0},null,null,{"$f":"B138/POWER(1+Paramètres!$AF$14,A138)","v":0}]
[40,{"$f":"($D$26*$E$28*$D$22*'Devis d''implantation des écrans'!$D$45*$D$24*$D$20)","v":0},{"$f":"SUM(B120:B139)","v":0},null,{"$f":"B139/POWER(1+Paramètres!$AF$14,A139)","v":0},{"$f":"SUM(E120:E139)","v":0},{"$f":"SUM(E100:E139)","v":0}]

{"sheet":"Amélioration de rendement","index":22,"n_rows":153,"n_cols":14,"rows_kept":153,"cut":false,"hidden":false,"merged":[[59,13,68,18],[43,0,43,2],[58,2,59,3],[75,7,75,8],[76,7,76,8],[74,7,74,8],[58,7,59,8],[63,7,63,8],[60,7,60,8],[71,7,71,8],[72,7,72,8],[73,7,73,8],[66,7,66,8],[69,7,69,8],[70,7,70,8],[65,2,65,3],[33,11,33,12],[67,4,67,6],[65,4,65,6],[66,4,66,6],[60,4,60,6],[62,4,62,6],[58,4,59,6],[65,7,65,8],[35,12,36,12],[77,2,77,3],[77,4,77,5],[67,2,67,3],[68,2,68,3],[68,7,68,8],[68,4,68,6],[112,0,112,1],[11,2,11,3],[60,2,60,3],[110,0,111,1],[37,0,37,1],[64,2,64,3],[63,2,63,3],[66,2,66,3],[39,0,39,1],[44,0,44,2],[12,2,12,3],[41,0,41,1],[40,0,40,1],[36,0,36,1],[38,0,38,1],[45,0,45,2],[13,4,13,5],[34,0,34,1],[35,0,35,1],[13,2,13,3],[6,2,6,3],[6,4,6,5],[7,2,7,3],[7,4,7,5],[8,2,8,3],[11,4,11,5],[8,4,8,5],[9,2,9,3],[9,4,9,5],[10,2,10,3],[12,4,12,5],[10,4,10,5],[0,0,0,9],[3,1,5,1],[3,2,5,3],[3,4,5,5],[3,6,5,6],[3,7,5,7],[3,8,5,8],[111,8,111,9],[110,3,111,5],[61,2,61,3],[61,7,61,8],[62,2,62,3],[110,6,111,6],[64,7,64,8],[64,4,64,6],[63,4,63,6],[67,7,67,8],[62,7,62,8],[61,4,61,6],[80,7,81,8],[77,7,77,8],[78,7,78,8],[79,7,79,8]]}
[]
[]
[]
[null,"Période","Améliorations",null,"Détériorations",null,"Marge","Marge actualisée ","Marge actualisée accumulée"]
[]
[]
[null,"0-5 ans",{"$f":"C118","v":0},null,0,null,{"$f":"C7+E7","v":0},{"$f":"F118","v":0},{"$f":"F118","v":0}]
[]
[null,"5-10 ans",{"$f":"C123","v":0},null,0,null,{"$f":"C9+E9","v":0},{"$f":"F123","v":0},{"$f":"G123","v":0}]
[]
[null,"10-20 ans",{"$f":"C133","v":0},null,0,null,{"$f":"C11+E11","v":0},{"$f":"F133","v":0},{"$f":"G133","v":0}]
[]
[null,"20-40 ans",{"$f":"C153","v":0},null,0,null,{"$f":"C13+E13","v":0},{"$f":"F153","v":0},{"$f":"G153","v":0}]
[]
[]
[]
[]
[]
[]
[]
[]
[]
[]
[]
[]
[]
[]
[]
[]
[]
[]
[]
[]
[null,null,null,null,null,null,null,null,null,null,null,"Croissance annuelle"]
["Rangée 1",null,"CON ou FNO",{"$f":"IF(OR('Devis d''implantation des écrans'!F42>0,'Devis d''implantation des écrans'!F44>0),TRUE,FALSE)","v":false},"PEH",{"$f":"IF('Devis d''implantation des écrans'!F43>0,TRUE,FALSE)","v":false},"SAV",{"$f":"IF('Devis d''implantation des écrans'!F46>0,TRUE,FALSE)","v":false},"ARB",{"$f":"IF('Devis d''implantation des écrans'!F45>0,TRUE,FALSE)","v":false},null,"PEH",1]
["Rangée 2",null,"CON ou FNO",{"$f":"IF(OR('Devis d''implantation des écrans'!G42>0,'Devis d''implantation des écrans'!G44>0),TRUE,FALSE)","v":false},"PEH",{"$f":"IF('Devis d''implantation des écrans'!G43>0,TRUE,FALSE)","v":false},"SAV",{"$f":"IF('Devis d''implantation des écrans'!G46>0,TRUE,FALSE)","v":false},"ARB",{"$f":"IF('Devis d''implantation des écrans'!G45>0,TRUE,FALSE)","v":false},null,"CON",0.5]
["Rangée 3",null,"CON ou FNO",{"$f":"IF(OR('Devis d''implantation des écrans'!H42>0,'Devis d''implantation des écrans'!H44>0),TRUE,FALSE)","v":false},"PEH",{"$f":"IF('Devis d''implantation des écrans'!H43>0,TRUE,FALSE)","v":false},"SAV",{"$f":"IF('Devis d''implantation des écrans'!H46>0,TRUE,FALSE)","v":false},"ARB",{"$f":"IF('Devis d''implantation des écrans'!H45>0,TRUE,FALSE)","v":false},null,"FNO"]
["Rangée 4",null,"CON ou FNO",{"$f":"IF(OR('Devis d''implantation des écrans'!H43>0,'Devis d''implantation des écrans'!H45>0),TRUE,FALSE)","v":false},"PEH",{"$f":"IF('Devis d''implantation des écrans'!H44>0,TRUE,FALSE)","v":false},"SAV",{"$f":"IF('Devis d''implantation des écrans'!H47>0,TRUE,FALSE)","v":false},"ARB",{"$f":"IF('Devis d''implantation des écrans'!H46>0,TRUE,FALSE)","v":false},null,"ARB",0.5]
["Rangée 5",null,"CON ou FNO",{"$f":"IF(OR('Devis d''implantation des écrans'!H44>0,'Devis d''implantation des écrans'!H46>0),TRUE,FALSE)","v":false},"PEH",{"$f":"IF('Devis d''implantation des écrans'!H45>0,TRUE,FALSE)","v":false},"SAV",{"$f":"IF('Devis d''implantation des écrans'!H48>0,TRUE,FALSE)","v":false},"ARB",{"$f":"IF('Devis d''implantation des écrans'!H47>0,TRUE,FALSE)","v":false},null,"SAH",2]
["Rangée 6",null,"CON ou FNO",{"$f":"IF(OR('Devis d''implantation des écrans'!H45>0,'Devis d''implantation des écrans'!H47>0),TRUE,FALSE)","v":false},"PEH",{"$f":"IF('Devis d''implantation des écrans'!H46>0,TRUE,FALSE)","v":false},"SAV",{"$f":"IF('Devis d''implantation des écrans'!H49>0,TRUE,FALSE)","v":false},"ARB",{"$f":"IF('Devis d''implantation des écrans'!H48>0,TRUE,FALSE)","v":false}]
["Rangée 7",null,"CON ou FNO",{"$f":"IF(OR('Devis d''implantation des écrans'!H46>0,'Devis d''implantation des écrans'!H48>0),TRUE,FALSE)","v":false},"PEH",{"$f":"IF('Devis d''implantation des écrans'!H47>0,TRUE,FALSE)","v":false},"SAV",{"$f":"IF('Devis d''implantation des écrans'!H50>0,TRUE,FALSE)","v":false},"ARB",{"$f":"IF('Devis d''implantation des écrans'!H49>0,TRUE,FALSE)","v":false}]
["Haie",null,"CON ou FNO",{"$f":"OR(D35=TRUE,D36=TRUE,D37=TRUE,D38=TRUE,D39=TRUE,D40=TRUE,D41=TRUE)","v":false},null,{"$f":"OR(F35=TRUE,F36=TRUE,F37=TRUE,F38=TRUE,F39=TRUE,F40=TRUE,F41=TRUE)","v":false},null,{"$f":"OR(H35=TRUE,H36=TRUE,H37=TRUE,H38=TRUE,H39=TRUE,H40=TRUE,H41=TRUE)","v":false},null,{"$f":"OR(J35=TRUE,J36=TRUE,J37=TRUE,J38=TRUE,J39=TRUE,J40=TRUE,J41=TRUE)","v":false}]
[]
["Croissance annuelle",null,null,{"$f":"MAX(IF('Devis d''implantation des écrans'!D$43>0,M35,0),IF(OR('Devis d''implantation des écrans'!D$42>0,'Devis d''implantation des écrans'!D$44),M36,0),IF('Devis d''implantation des écrans'!D$46>0,M39,0),IF('Devis d''implantation des écrans'!D$45>0,M38,0))","v":0},"m"]
["Hauteur maximale de la haie",null,null,{"$f":"MAX(IF('Devis d''implantation des écrans'!D$43>0,Paramètres!I100,0),IF(OR('Devis d''implantation des écrans'!D$42>0,'Devis d''implantation des écrans'!D$44),Paramètres!I101,0),IF('Devis d''implantation des écrans'!D$46>0,Paramètres!I102,0),IF('Devis d''implantation des écrans'!D$45>0,Paramètres!I103,0))","v":0},"m"]
["Protection de culture",null,null,{"$f":"AND(OR(Questionnaire!F144=\"Oui\",Questionnaire!F144=\"Yes\"))","v":false},{"$f":"IF(D46=FALSE,0,Questionnaire!F151)*IF('Devis d''implantation des écrans'!D47>0,1,0)","v":0},"%"]
[null,null,"Hauteur début protection",2,"m"]
[]
[]
[]
[]
[]
[]
["Longueur de la protection",null,null,{"$f":"Questionnaire!G147","v":0}]
[]
["Rotation sur combien d'année ?",null,null,{"$f":"Questionnaire!G83","v":0}]
[]
[]
[null,null,null,null,null,null,null,"Année de référence",null,"Amélioration de la marge (produits sur débours/ha) avec protection de culture"]
["Choix de rotation",null,null,null,null,null,null,null,null,null,null,null,null,"Le calcul de la marge moyenne des produits sur débours n'est pas bon car ça vient fausser les données si on avait des culture de grandes valeurs semées lorsque le brise-vent est plus mature…."]
[{"$f":"Questionnaire!C$87","v":"..."},null,null,null,null,null,null,1,null,{"$f":"SUMIF(Paramètres!F$107:G$131,A$61:A$80,Paramètres!H$107:I$131)*E$46","v":0}]
[{"$f":"Questionnaire!C$88","v":"..."},null,null,null,null,null,null,2,null,{"$f":"SUMIF(Paramètres!F$107:G$131,A$61:A$80,Paramètres!H$107:I$131)*E$46","v":0}]
[{"$f":"Questionnaire!C$89","v":"..."},null,null,null,null,null,null,3,null,{"$f":"SUMIF(Paramètres!F$107:G$131,A$61:A$80,Paramètres!H$107:I$131)*E$46","v":0}]
[{"$f":"Questionnaire!E$87","v":"..."},null,null,null,null,null,null,4,null,{"$f":"SUMIF(Paramètres!F$107:G$131,A$61:A$80,Paramètres!H$107:I$131)*E$46","v":0}]
[{"$f":"Questionnaire!E$88","v":"..."},null,null,null,null,null,null,5,null,{"$f":"SUMIF(Paramètres!F$107:G$131,A$61:A$80,Paramètres!H$107:I$131)*E$46","v":0}]
[{"$f":"Questionnaire!E$89","v":"..."},null,null,null,null,null,null,6,null,{"$f":"SUMIF(Paramètres!F$107:G$131,A$61:A$80,Paramètres!H$107:I$131)*E$46","v":0}]
[{"$f":"Questionnaire!G$87","v":"..."},null,null,null,null,null,null,7,null,{"$f":"SUMIF(Paramètres!F$107:G$131,A$61:A$80,Paramètres!H$107:I$131)*E$46","v":0}]
[{"$f":"Questionnaire!G$88","v":"..."},null,null,null,null,null,null,8,null,{"$f":"SUMIF(Paramètres!F$107:G$131,A$61:A$80,Paramètres!H$107:I$131)*E$46","v":0}]
[{"$f":"Questionnaire!G$89","v":"..."},null,null,null,null,null,null,9,null,{"$f":"SUMIF(Paramètres!F$107:G$131,A$61:A$80,Paramètres!H$107:I$131)*E$46","v":0}]
[{"$f":"Questionnaire!I$87","v":"..."},null,null,null,null,null,null,10,null,{"$f":"SUMIF(Paramètres!F$107:G$131,A$61:A$80,Paramètres!H$107:I$131)*E$46","v":0}]
[{"$f":"Questionnaire!I$88","v":"..."},null,null,null,null,null,null,11,null,{"$f":"SUMIF(Paramètres!F$107:G$131,A$61:A$80,Paramètres!H$107:I$131)*E$46","v":0}]
[{"$f":"Questionnaire!I$89","v":"..."},null,null,null,null,null,null,12,null,{"$f":"SUMIF(Paramètres!F$107:G$131,A$61:A$80,Paramètres!H$107:I$131)*E$46","v":0}]
[{"$f":"Questionnaire!K$87","v":"..."},null,null,null,null,null,null,13,null,{"$f":"SUMIF(Paramètres!F$107:G$131,A$61:A$80,Paramètres!H$107:I$131)*E$46","v":0}]
[{"$f":"Questionnaire!K$88","v":"..."},null,null,null,null,null,null,14,null,{"$f":"SUMIF(Paramètres!F$107:G$131,A$61:A$80,Paramètres!H$107:I$131)*E$46","v":0}]
[{"$f":"Questionnaire!K$89","v":"..."},null,null,null,null,null,null,15,null,{"$f":"SUMIF(Paramètres!F$107:G$131,A$61:A$80,Paramètres!H$107:I$131)*E$46","v":0}]
[{"$f":"Questionnaire!M$87","v":"..."},null,null,null,null,null,null,16,null,{"$f":"SUMIF(Paramètres!F$107:G$131,A$61:A$80,Paramètres!H$107:I$131)*E$46","v":0}]
[{"$f":"Questionnaire!M$88","v":"..."},null,null,null,null,null,null,17,null,{"$f":"SUMIF(Paramètres!F$107:G$131,A$61:A$80,Paramètres!H$107:I$131)*E$46","v":0}]
[{"$f":"Questionnaire!M$89","v":"..."},null,null,null,null,null,null,18,null,{"$f":"SUMIF(Paramètres!F$107:G$131,A$61:A$80,Paramètres!H$107:I$131)*E$46","v":0}]
[{"$f":"Questionnaire!O$87","v":"..."},null,null,null,null,null,null,19,null,{"$f":"SUMIF(Paramètres!F$107:G$131,A$61:A$80,Paramètres!H$107:I$131)*E$46","v":0}]
[{"$f":"Questionnaire!O$88","v":"..."},null,null,null,null,null,null,20,null,{"$f":"SUMIF(Paramètres!F$107:G$131,A$61:A$80,Paramètres!H$107:I$131)*E$46","v":0}]
[null,null,null,null,null,null,null,"Marge moyenne des produits sur débours   /ha",null,{"$f":"IF(OR(Questionnaire!F144=\"Oui\",Questionnaire!F144=\"Yes\"),(SUM(J61:L80))/D56,0)","v":0}]
[]
[]
[]
[]
[]
[]
[]
[]
[]
[]
[]
[]
[]
[]
[]
[]
[]
[]
[]
[]
[]
[]
[]
[]
[]
[]
[]
[]
[]
["Améliorations",null,null,"Marge actualisée",null,null,"Marge actualisée accumulée"]
[null,null,null,null,null,null,null,null,"hauteur de la haie selon les années",null,"ajusté en fonction de la récolte des PEH à 20 ans et la présence de FNO ou CON"]
["total cumulatif à l'an",null,null,null,null,null,null,null,"année","hauteur","année saule"]
[1,{"$f":"IF(J114>D$47,($E$46*$J$81*Questionnaire!H$149*$D$54*J114)/10000,0)","v":0},null,null,{"$f":"IF(J114>D$47,(($E$46*$J$81*Questionnaire!H$149*$D$54*J114)/10000)/POWER(1+Paramètres!$AF$14,A114),0)","v":0},null,null,null,1,{"$f":"MAX(IF(D$42=TRUE,'Entretien des écrans boisés'!S26),IF(F$42=TRUE,'Entretien des écrans boisés'!Q26),IF(H$42=TRUE,(IF(Questionnaire!$C$114=TRUE,M$39*K114,MIN(M$39*I114,D$45))),IF(J$42=TRUE,MIN(M$38*I114,D$45))))","v":0},1]
[2,{"$f":"IF(J115>D$47,($E$46*$J$81*Questionnaire!H$149*$D$54*J115)/10000,0)","v":0},null,null,{"$f":"IF(J115>D$47,(($E$46*$J$81*Questionnaire!H$149*$D$54*J115)/10000)/POWER(1+Paramètres!$AF$14,A115),0)","v":0},null,null,null,2,{"$f":"MAX(IF(D$42=TRUE,'Entretien des écrans boisés'!S27),IF(F$42=TRUE,'Entretien des écrans boisés'!Q27),IF(H$42=TRUE,(IF(Questionnaire!$C$114=TRUE,M$39*K115,MIN(M$39*I115,D$45))),IF(J$42=TRUE,MIN(M$38*I115,D$45))))","v":0},2]
[3,{"$f":"IF(J116>D$47,($E$46*$J$81*Questionnaire!H$149*$D$54*J116)/10000,0)","v":0},null,null,{"$f":"IF(J116>D$47,(($E$46*$J$81*Questionnaire!H$149*$D$54*J116)/10000)/POWER(1+Paramètres!$AF$14,A116),0)","v":0},null,null,null,3,{"$f":"MAX(IF(D$42=TRUE,'Entretien des écrans boisés'!S28),IF(F$42=TRUE,'Entretien des écrans boisés'!Q28),IF(H$42=TRUE,(IF(Questionnaire!$C$114=TRUE,M$39*K116,MIN(M$39*I116,D$45))),IF(J$42=TRUE,MIN(M$38*I116,D$45))))","v":0},3]
[4,{"$f":"IF(J117>D$47,($E$46*$J$81*Questionnaire!H$149*$D$54*J117)/10000,0)","v":0},null,null,{"$f":"IF(J117>D$47,(($E$46*$J$81*Questionnaire!H$149*$D$54*J117)/10000)/POWER(1+Paramètres!$AF$14,A117),0)","v":0},null,null,null,4,{"$f":"MAX(IF(D$42=TRUE,'Entretien des écrans boisés'!S29),IF(F$42=TRUE,'Entretien des écrans boisés'!Q29),IF(H$42=TRUE,(IF(Questionnaire!$C$114=TRUE,M$39*K117,MIN(M$39*I117,D$45))),IF(J$42=TRUE,MIN(M$38*I117,D$45))))","v":0},1]
[5,{"$f":"IF(J118>D$47,($E$46*$J$81*Questionnaire!H$149*$D$54*J118)/10000,0)","v":0},{"$f":"SUM(B114:B118)","v":0},null,{"$f":"IF(J118>D$47,(($E$46*$J$81*Questionnaire!H$149*$D$54*J118)/10000)/POWER(1+Paramètres!$AF$14,A118),0)","v":0},{"$f":"SUM(E114:E118)","v":0},null,null,5,{"$f":"MAX(IF(D$42=TRUE,'Entretien des écrans boisés'!S30),IF(F$42=TRUE,'Entretien des écrans boisés'!Q30),IF(H$42=TRUE,(IF(Questionnaire!$C$114=TRUE,M$39*K118,MIN(M$39*I118,D$45))),IF(J$42=TRUE,MIN(M$38*I118,D$45))))","v":0},2]
[6,{"$f":"IF(J119>D$47,($E$46*$J$81*Questionnaire!H$149*$D$54*J119)/10000,0)","v":0},null,null,{"$f":"IF(J119>D$47,(($E$46*$J$81*Questionnaire!H$149*$D$54*J119)/10000)/POWER(1+Paramètres!$AF$14,A119),0)","v":0},null,null,null,6,{"$f":"MAX(IF(D$42=TRUE,'Entretien des écrans boisés'!S31),IF(F$42=TRUE,'Entretien des écrans boisés'!Q31),IF(H$42=TRUE,(IF(Questionnaire!$C$114=TRUE,M$39*K119,MIN(M$39*I119,D$45))),IF(J$42=TRUE,MIN(M$38*I119,D$45))))","v":0},3]
[7,{"$f":"IF(J120>D$47,($E$46*$J$81*Questionnaire!H$149*$D$54*J120)/10000,0)","v":0},null,null,{"$f":"IF(J120>D$47,(($E$46*$J$81*Questionnaire!H$149*$D$54*J120)/10000)/POWER(1+Paramètres!$AF$14,A120),0)","v":0},null,null,null,7,{"$f":"MAX(IF(D$42=TRUE,'Entretien des écrans boisés'!S32),IF(F$42=TRUE,'Entretien des écrans boisés'!Q32),IF(H$42=TRUE,(IF(Questionnaire!$C$114=TRUE,M$39*K120,MIN(M$39*I120,D$45))),IF(J$42=TRUE,MIN(M$38*I120,D$45))))","v":0},1]
[8,{"$f":"IF(J121>D$47,($E$46*$J$81*Questionnaire!H$149*$D$54*J121)/10000,0)","v":0},null,null,{"$f":"IF(J121>D$47,(($E$46*$J$81*Questionnaire!H$149*$D$54*J121)/10000)/POWER(1+Paramètres!$AF$14,A121),0)","v":0},null,null,null,8,{"$f":"MAX(IF(D$42=TRUE,'Entretien des écrans boisés'!S33),IF(F$42=TRUE,'Entretien des écrans boisés'!Q33),IF(H$42=TRUE,(IF(Questionnaire!$C$114=TRUE,M$39*K121,MIN(M$39*I121,D$45))),IF(J$42=TRUE,MIN(M$38*I121,D$45))))","v":0},2]
[9,{"$f":"IF(J122>D$47,($E$46*$J$81*Questionnaire!H$149*$D$54*J122)/10000,0)","v":0},null,null,{"$f":"IF(J122>D$47,(($E$46*$J$81*Questionnaire!H$149*$D$54*J122)/10000)/POWER(1+Paramètres!$AF$14,A122),0)","v":0},null,null,null,9,{"$f":"MAX(IF(D$42=TRUE,'Entretien des écrans boisés'!S34),IF(F$42=TRUE,'Entretien des écrans boisés'!Q34),IF(H$42=TRUE,(IF(Questionnaire!$C$114=TRUE,M$39*K122,MIN(M$39*I122,D$45))),IF(J$42=TRUE,MIN(M$38*I122,D$45))))","v":0},3]
[10,{"$f":"IF(J123>D$47,($E$46*$J$81*Questionnaire!H$149*$D$54*J123)/10000,0)","v":0},{"$f":"SUM(B119:B123)","v":0},{"$f":"SUM(B114:B123)","v":0},{"$f":"IF(J123>D$47,(($E$46*$J$81*Questionnaire!H$149*$D$54*J123)/10000)/POWER(1+Paramètres!$AF$14,A123),0)","v":0},{"$f":"SUM(E119:E123)","v":0},{"$f":"SUM(E114:E123)","v":0},null,10,{"$f":"MAX(IF(D$42=TRUE,'Entretien des écrans boisés'!S35),IF(F$42=TRUE,'Entretien des écrans boisés'!Q35),IF(H$42=TRUE,(IF(Questionnaire!$C$114=TRUE,M$39*K123,MIN(M$39*I123,D$45))),IF(J$42=TRUE,MIN(M$38*I123,D$45))))","v":0},1]
[11,{"$f":"IF(J124>D$47,($E$46*$J$81*Questionnaire!H$149*$D$54*J124)/10000,0)","v":0},null,null,{"$f":"IF(J124>D$47,(($E$46*$J$81*Questionnaire!H$149*$D$54*J124)/10000)/POWER(1+Paramètres!$AF$14,A124),0)","v":0},null,null,null,11,{"$f":"MAX(IF(D$42=TRUE,'Entretien des écrans boisés'!S36),IF(F$42=TRUE,'Entretien des écrans boisés'!Q36),IF(H$42=TRUE,(IF(Questionnaire!$C$114=TRUE,M$39*K124,MIN(M$39*I124,D$45))),IF(J$42=TRUE,MIN(M$38*I124,D$45))))","v":0},2]
[12,{"$f":"IF(J125>D$47,($E$46*$J$81*Questionnaire!H$149*$D$54*J125)/10000,0)","v":0},null,null,{"$f":"IF(J125>D$47,(($E$46*$J$81*Questionnaire!H$149*$D$54*J125)/10000)/POWER(1+Paramètres!$AF$14,A125),0)","v":0},null,null,null,12,{"$f":"MAX(IF(D$42=TRUE,'Entretien des écrans boisés'!S37),IF(F$42=TRUE,'Entretien des écrans boisés'!Q37),IF(H$42=TRUE,(IF(Questionnaire!$C$114=TRUE,M$39*K125,MIN(M$39*I125,D$45))),IF(J$42=TRUE,MIN(M$38*I125,D$45))))","v":0},3]
[13,{"$f":"IF(J126>D$47,($E$46*$J$81*Questionnaire!H$149*$D$54*J126)/10000,0)","v":0},null,null,{"$f":"IF(J126>D$47,(($E$46*$J$81*Questionnaire!H$149*$D$54*J126)/10000)/POWER(1+Paramètres!$AF$14,A126),0)","v":0},null,null,null,13,{"$f":"MAX(IF(D$42=TRUE,'Entretien des écrans boisés'!S38),IF(F$42=TRUE,'Entretien des écrans boisés'!Q38),IF(H$42=TRUE,(IF(Questionnaire!$C$114=TRUE,M$39*K126,MIN(M$39*I126,D$45))),IF(J$42=TRUE,MIN(M$38*I126,D$45))))","v":0},1]
[14,{"$f":"IF(J127>D$47,($E$46*$J$81*Questionnaire!H$149*$D$54*J127)/10000,0)","v":0},null,null,{"$f":"IF(J127>D$47,(($E$46*$J$81*Questionnaire!H$149*$D$54*J127)/10000)/POWER(1+Paramètres!$AF$14,A127),0)","v":0},null,null,null,14,{"$f":"MAX(IF(D$42=TRUE,'Entretien des écrans boisés'!S39),IF(F$42=TRUE,'Entretien des écrans boisés'!Q39),IF(H$42=TRUE,(IF(Questionnaire!$C$114=TRUE,M$39*K127,MIN(M$39*I127,D$45))),IF(J$42=TRUE,MIN(M$38*I127,D$45))))","v":0},2]
[15,{"$f":"IF(J128>D$47,($E$46*$J$81*Questionnaire!H$149*$D$54*J128)/10000,0)","v":0},null,null,{"$f":"IF(J128>D$47,(($E$46*$J$81*Questionnaire!H$149*$D$54*J128)/10000)/POWER(1+Paramètres!$AF$14,A128),0)","v":0},null,null,null,15,{"$f":"MAX(IF(D$42=TRUE,'Entretien des écrans boisés'!S40),IF(F$42=TRUE,'Entretien des écrans boisés'!Q40),IF(H$42=TRUE,(IF(Questionnaire!$C$114=TRUE,M$39*K128,MIN(M$39*I128,D$45))),IF(J$42=TRUE,MIN(M$38*I128,D$45))))","v":0},3]
[16,{"$f":"IF(J129>D$47,($E$46*$J$81*Questionnaire!H$149*$D$54*J129)/10000,0)","v":0},null,null,{"$f":"IF(J129>D$47,(($E$46*$J$81*Questionnaire!H$149*$D$54*J129)/10000)/POWER(1+Paramètres!$AF$14,A129),0)","v":0},null,null,null,16,{"$f":"MAX(IF(D$42=TRUE,'Entretien des écrans boisés'!S41),IF(F$42=TRUE,'Entretien des écrans boisés'!Q41),IF(H$42=TRUE,(IF(Questionnaire!$C$114=TRUE,M$39*K129,MIN(M$39*I129,D$45))),IF(J$42=TRUE,MIN(M$38*I129,D$45))))","v":0},1]
[17,{"$f":"IF(J130>D$47,($E$46*$J$81*Questionnaire!H$149*$D$54*J130)/10000,0)","v":0},null,null,{"$f":"IF(J130>D$47,(($E$46*$J$81*Questionnaire!H$149*$D$54*J130)/10000)/POWER(1+Paramètres!$AF$14,A130),0)","v":0},null,null,null,17,{"$f":"MAX(IF(D$42=TRUE,'Entretien des écrans boisés'!S42),IF(F$42=TRUE,'Entretien des écrans boisés'!Q42),IF(H$42=TRUE,(IF(Questionnaire!$C$114=TRUE,M$39*K130,MIN(M$39*I130,D$45))),IF(J$42=TRUE,MIN(M$38*I130,D$45))))","v":0},2]
[18,{"$f":"IF(J131>D$47,($E$46*$J$81*Questionnaire!H$149*$D$54*J131)/10000,0)","v":0},null,null,{"$f":"IF(J131>D$47,(($E$46*$J$81*Questionnaire!H$149*$D$54*J131)/10000)/POWER(1+Paramètres!$AF$14,A131),0)","v":0},null,null,null,18,{"$f":"MAX(IF(D$42=TRUE,'Entretien des écrans boisés'!S43),IF(F$42=TRUE,'Entretien des écrans boisés'!Q43),IF(H$42=TRUE,(IF(Questionnaire!$C$114=TRUE,M$39*K131,MIN(M$39*I131,D$45))),IF(J$42=TRUE,MIN(M$38*I131,D$45))))","v":0},3]
[19,{"$f":"IF(J132>D$47,($E$46*$J$81*Questionnaire!H$149*$D$54*J132)/10000,0)","v":0},null,null,{"$f":"IF(J132>D$47,(($E$46*$J$81*Questionnaire!H$149*$D$54*J132)/10000)/POWER(1+Paramètres!$AF$14,A132),0)","v":0},null,null,null,19,{"$f":"MAX(IF(D$42=TRUE,'Entretien des écrans boisés'!S44),IF(F$42=TRUE,'Entretien des écrans boisés'!Q44),IF(H$42=TRUE,(IF(Questionnaire!$C$114=TRUE,M$39*K132,MIN(M$39*I132,D$45))),IF(J$42=TRUE,MIN(M$38*I132,D$45))))","v":0},1]
[20,{"$f":"IF(J133>D$47,($E$46*$J$81*Questionnaire!H$149*$D$54*J133)/10000,0)","v":0},{"$f":"SUM(B124:B133)","v":0},{"$f":"SUM(B114:B133)","v":0},{"$f":"IF(J133>D$47,(($E$46*$J$81*Questionnaire!H$149*$D$54*J133)/10000)/POWER(1+Paramètres!$AF$14,A133),0)","v":0},{"$f":"SUM(E124:E133)","v":0},{"$f":"SUM(E114:E133)","v":0},null,20,{"$f":"MAX(IF(D$42=TRUE,'Entretien des écrans boisés'!S45),IF(F$42=TRUE,'Entretien des écrans boisés'!Q45),IF(H$42=TRUE,(IF(Questionnaire!$C$114=TRUE,M$39*K133,MIN(M$39*I133,D$45))),IF(J$42=TRUE,MIN(M$38*I133,D$45))))","v":0},2]
[21,{"$f":"IF(J134>D$47,($E$46*$J$81*Questionnaire!H$149*$D$54*J134)/10000,0)","v":0},null,null,{"$f":"IF(J134>D$47,(($E$46*$J$81*Questionnaire!H$149*$D$54*J134)/10000)/POWER(1+Paramètres!$AF$14,A134),0)","v":0},null,null,null,21,{"$f":"MAX(IF(D$42=TRUE,'Entretien des écrans boisés'!S46),IF(F$42=TRUE,'Entretien des écrans boisés'!Q46),IF(H$42=TRUE,(IF(Questionnaire!$C$114=TRUE,M$39*K134,MIN(M$39*I134,D$45))),IF(J$42=TRUE,MIN(M$38*I134,D$45))))","v":0},3]
[22,{"$f":"IF(J135>D$47,($E$46*$J$81*Questionnaire!H$149*$D$54*J135)/10000,0)","v":0},null,null,{"$f":"IF(J135>D$47,(($E$46*$J$81*Questionnaire!H$149*$D$54*J135)/10000)/POWER(1+Paramètres!$AF$14,A135),0)","v":0},null,null,null,22,{"$f":"MAX(IF(D$42=TRUE,'Entretien des écrans boisés'!S47),IF(F$42=TRUE,'Entretien des écrans boisés'!Q47),IF(H$42=TRUE,(IF(Questionnaire!$C$114=TRUE,M$39*K135,MIN(M$39*I135,D$45))),IF(J$42=TRUE,MIN(M$38*I135,D$45))))","v":0},1]
[23,{"$f":"IF(J136>D$47,($E$46*$J$81*Questionnaire!H$149*$D$54*J136)/10000,0)","v":0},null,null,{"$f":"IF(J136>D$47,(($E$46*$J$81*Questionnaire!H$149*$D$54*J136)/10000)/POWER(1+Paramètres!$AF$14,A136),0)","v":0},null,null,null,23,{"$f":"MAX(IF(D$42=TRUE,'Entretien des écrans boisés'!S48),IF(F$42=TRUE,'Entretien des écrans boisés'!Q48),IF(H$42=TRUE,(IF(Questionnaire!$C$114=TRUE,M$39*K136,MIN(M$39*I136,D$45))),IF(J$42=TRUE,MIN(M$38*I136,D$45))))","v":0},2]
[24,{"$f":"IF(J137>D$47,($E$46*$J$81*Questionnaire!H$149*$D$54*J137)/10000,0)","v":0},null,null,{"$f":"IF(J137>D$47,(($E$46*$J$81*Questionnaire!H$149*$D$54*J137)/10000)/POWER(1+Paramètres!$AF$14,A137),0)","v":0},null,null,null,24,{"$f":"MAX(IF(D$42=TRUE,'Entretien des écrans boisés'!S49),IF(F$42=TRUE,'Entretien des écrans boisés'!Q49),IF(H$42=TRUE,(IF(Questionnaire!$C$114=TRUE,M$39*K137,MIN(M$39*I137,D$45))),IF(J$42=TRUE,MIN(M$38*I137,D$45))))","v":0},3]
[25,{"$f":"IF(J138>D$47,($E$46*$J$81*Questionnaire!H$149*$D$54*J138)/10000,0)","v":0},null,null,{"$f":"IF(J138>D$47,(($E$46*$J$81*Questionnaire!H$149*$D$54*J138)/10000)/POWER(1+Paramètres!$AF$14,A138),0)","v":0},null,null,null,25,{"$f":"MAX(IF(D$42=TRUE,'Entretien des écrans boisés'!S50),IF(F$42=TRUE,'Entretien des écrans boisés'!Q50),IF(H$42=TRUE,(IF(Questionnaire!$C$114=TRUE,M$39*K138,MIN(M$39*I138,D$45))),IF(J$42=TRUE,MIN(M$38*I138,D$45))))","v":0},1]
[26,{"$f":"IF(J139>D$47,($E$46*$J$81*Questionnaire!H$149*$D$54*J139)/10000,0)","v":0},null,null,{"$f":"IF(J139>D$47,(($E$46*$J$81*Questionnaire!H$149*$D$54*J139)/10000)/POWER(1+Paramètres!$AF$14,A139),0)","v":0},null,null,null,26,{"$f":"MAX(IF(D$42=TRUE,'Entretien des écrans boisés'!S51),IF(F$42=TRUE,'Entretien des écrans boisés'!Q51),IF(H$42=TRUE,(IF(Questionnaire!$C$114=TRUE,M$39*K139,MIN(M$39*I139,D$45))),IF(J$42=TRUE,MIN(M$38*I139,D$45))))","v":0},2]
[27,{"$f":"IF(J140>D$47,($E$46*$J$81*Questionnaire!H$149*$D$54*J140)/10000,0)","v":0},null,null,{"$f":"IF(J140>D$47,(($E$46*$J$81*Questionnaire!H$149*$D$54*J140)/10000)/POWER(1+Paramètres!$AF$14,A140),0)","v":0},null,null,null,27,{"$f":"MAX(IF(D$42=TRUE,'Entretien des écrans boisés'!S52),IF(F$42=TRUE,'Entretien des écrans boisés'!Q52),IF(H$42=TRUE,(IF(Questionnaire!$C$114=TRUE,M$39*K140,MIN(M$39*I140,D$45))),IF(J$42=TRUE,MIN(M$38*I140,D$45))))","v":0},3]
[28,{"$f":"IF(J141>D$47,($E$46*$J$81*Questionnaire!H$149*$D$54*J141)/10000,0)","v":0},null,null,{"$f":"IF(J141>D$47,(($E$46*$J$81*Questionnaire!H$149*$D$54*J141)/10000)/POWER(1+Paramètres!$AF$14,A141),0)","v":0},null,null,null,28,{"$f":"MAX(IF(D$42=TRUE,'Entretien des écrans boisés'!S53),IF(F$42=TRUE,'Entretien des écrans boisés'!Q53),IF(H$42=TRUE,(IF(Questionnaire!$C$114=TRUE,M$39*K141,MIN(M$39*I141,D$45))),IF(J$42=TRUE,MIN(M$38*I141,D$45))))","v":0},1]
[29,{"$f":"IF(J142>D$47,($E$46*$J$81*Questionnaire!H$149*$D$54*J142)/10000,0)","v":0},null,null,{"$f":"IF(J142>D$47,(($E$46*$J$81*Questionnaire!H$149*$D$54*J142)/10000)/POWER(1+Paramètres!$AF$14,A142),0)","v":0},null,null,null,29,{"$f":"MAX(IF(D$42=TRUE,'Entretien des écrans boisés'!S54),IF(F$42=TRUE,'Entretien des écrans boisés'!Q54),IF(H$42=TRUE,(IF(Questionnaire!$C$114=TRUE,M$39*K142,MIN(M$39*I142,D$45))),IF(J$42=TRUE,MIN(M$38*I142,D$45))))","v":0},2]
[30,{"$f":"IF(J143>D$47,($E$46*$J$81*Questionnaire!H$149*$D$54*J143)/10000,0)","v":0},null,null,{"$f":"IF(J143>D$47,(($E$46*$J$81*Questionnaire!H$149*$D$54*J143)/10000)/POWER(1+Paramètres!$AF$14,A143),0)","v":0},null,null,null,30,{"$f":"MAX(IF(D$42=TRUE,'Entretien des écrans boisés'!S55),IF(F$42=TRUE,'Entretien des écrans boisés'!Q55),IF(H$42=TRUE,(IF(Questionnaire!$C$114=TRUE,M$39*K143,MIN(M$39*I143,D$45))),IF(J$42=TRUE,MIN(M$38*I143,D$45))))","v":0},3]
[31,{"$f":"IF(J144>D$47,($E$46*$J$81*Questionnaire!H$149*$D$54*J144)/10000,0)","v":0},null,null,{"$f":"IF(J144>D$47,(($E$46*$J$81*Questionnaire!H$149*$D$54*J144)/10000)/POWER(1+Paramètres!$AF$14,A144),0)","v":0},null,null,null,31,{"$f":"MAX(IF(D$42=TRUE,'Entretien des écrans boisés'!S56),IF(F$42=TRUE,'Entretien des écrans boisés'!Q56),IF(H$42=TRUE,(IF(Questionnaire!$C$114=TRUE,M$39*K144,MIN(M$39*I144,D$45))),IF(J$42=TRUE,MIN(M$38*I144,D$45))))","v":0},1]
[32,{"$f":"IF(J145>D$47,($E$46*$J$81*Questionnaire!H$149*$D$54*J145)/10000,0)","v":0},null,null,{"$f":"IF(J145>D$47,(($E$46*$J$81*Questionnaire!H$149*$D$54*J145)/10000)/POWER(1+Paramètres!$AF$14,A145),0)","v":0},null,null,null,32,{"$f":"MAX(IF(D$42=TRUE,'Entretien des écrans boisés'!S57),IF(F$42=TRUE,'Entretien des écrans boisés'!Q57),IF(H$42=TRUE,(IF(Questionnaire!$C$114=TRUE,M$39*K145,MIN(M$39*I145,D$45))),IF(J$42=TRUE,MIN(M$38*I145,D$45))))","v":0},2]
[33,{"$f":"IF(J146>D$47,($E$46*$J$81*Questionnaire!H$149*$D$54*J146)/10000,0)","v":0},null,null,{"$f":"IF(J146>D$47,(($E$46*$J$81*Questionnaire!H$149*$D$54*J146)/10000)/POWER(1+Paramètres!$AF$14,A146),0)","v":0},null,null,null,33,{"$f":"MAX(IF(D$42=TRUE,'Entretien des écrans boisés'!S58),IF(F$42=TRUE,'Entretien des écrans boisés'!Q58),IF(H$42=TRUE,(IF(Questionnaire!$C$114=TRUE,M$39*K146,MIN(M$39*I146,D$45))),IF(J$42=TRUE,MIN(M$38*I146,D$45))))","v":0},3]
[34,{"$f":"IF(J147>D$47,($E$46*$J$81*Questionnaire!H$149*$D$54*J147)/10000,0)","v":0},null,null,{"$f":"IF(J147>D$47,(($E$46*$J$81*Questionnaire!H$149*$D$54*J147)/10000)/POWER(1+Paramètres!$AF$14,A147),0)","v":0},null,null,null,34,{"$f":"MAX(IF(D$42=TRUE,'Entretien des écrans boisés'!S59),IF(F$42=TRUE,'Entretien des écrans boisés'!Q59),IF(H$42=TRUE,(IF(Questionnaire!$C$114=TRUE,M$39*K147,MIN(M$39*I147,D$45))),IF(J$42=TRUE,MIN(M$38*I147,D$45))))","v":0},1]
[35,{"$f":"IF(J148>D$47,($E$46*$J$81*Questionnaire!H$149*$D$54*J148)/10000,0)","v":0},null,null,{"$f":"IF(J148>D$47,(($E$46*$J$81*Questionnaire!H$149*$D$54*J148)/10000)/POWER(1+Paramètres!$AF$14,A148),0)","v":0},null,null,null,35,{"$f":"MAX(IF(D$42=TRUE,'Entretien des écrans boisés'!S60),IF(F$42=TRUE,'Entretien des écrans boisés'!Q60),IF(H$42=TRUE,(IF(Questionnaire!$C$114=TRUE,M$39*K148,MIN(M$39*I148,D$45))),IF(J$42=TRUE,MIN(M$38*I148,D$45))))","v":0},2]
[36,{"$f":"IF(J149>D$47,($E$46*$J$81*Questionnaire!H$149*$D$54*J149)/10000,0)","v":0},null,null,{"$f":"IF(J149>D$47,(($E$46*$J$81*Questionnaire!H$149*$D$54*J149)/10000)/POWER(1+Paramètres!$AF$14,A149),0)","v":0},null,null,null,36,{"$f":"MAX(IF(D$42=TRUE,'Entretien des écrans boisés'!S61),IF(F$42=TRUE,'Entretien des écrans boisés'!Q61),IF(H$42=TRUE,(IF(Questionnaire!$C$114=TRUE,M$39*K149,MIN(M$39*I149,D$45))),IF(J$42=TRUE,MIN(M$38*I149,D$45))))","v":0},3]
[37,{"$f":"IF(J150>D$47,($E$46*$J$81*Questionnaire!H$149*$D$54*J150)/10000,0)","v":0},null,null,{"$f":"IF(J150>D$47,(($E$46*$J$81*Questionnaire!H$149*$D$54*J150)/10000)/POWER(1+Paramètres!$AF$14,A150),0)","v":0},null,null,null,37,{"$f":"MAX(IF(D$42=TRUE,'Entretien des écrans boisés'!S62),IF(F$42=TRUE,'Entretien des écrans boisés'!Q62),IF(H$42=TRUE,(IF(Questionnaire!$C$114=TRUE,M$39*K150,MIN(M$39*I150,D$45))),IF(J$42=TRUE,MIN(M$38*I150,D$45))))","v":0},1]
[38,{"$f":"IF(J151>D$47,($E$46*$J$81*Questionnaire!H$149*$D$54*J151)/10000,0)","v":0},null,null,{"$f":"IF(J151>D$47,(($E$46*$J$81*Questionnaire!H$149*$D$54*J151)/10000)/POWER(1+Paramètres!$AF$14,A151),0)","v":0},null,null,null,38,{"$f":"MAX(IF(D$42=TRUE,'Entretien des écrans boisés'!S63),IF(F$42=TRUE,'Entretien des écrans boisés'!Q63),IF(H$42=TRUE,(IF(Questionnaire!$C$114=TRUE,M$39*K151,MIN(M$39*I151,D$45))),IF(J$42=TRUE,MIN(M$38*I151,D$45))))","v":0},2]
[39,{"$f":"IF(J152>D$47,($E$46*$J$81*Questionnaire!H$149*$D$54*J152)/10000,0)","v":0},null,null,{"$f":"IF(J152>D$47,(($E$46*$J$81*Questionnaire!H$149*$D$54*J152)/10000)/POWER(1+Paramètres!$AF$14,A152),0)","v":0},null,null,null,39,{"$f":"MAX(IF(D$42=TRUE,'Entretien des écrans boisés'!S64),IF(F$42=TRUE,'Entretien des écrans boisés'!Q64),IF(H$42=TRUE,(IF(Questionnaire!$C$114=TRUE,M$39*K152,MIN(M$39*I152,D$45))),IF(J$42=TRUE,MIN(M$38*I152,D$45))))","v":0},3]
[40,{"$f":"IF(J153>D$47,($E$46*$J$81*Questionnaire!H$149*$D$54*J153)/10000,0)","v":0},{"$f":"SUM(B134:B153)","v":0},{"$f":"SUM(B114:B153)","v":0},{"$f":"IF(J153>D$47,(($E$46*$J$81*Questionnaire!H$149*$D$54*J153)/10000)/POWER(1+Paramètres!$AF$14,A153),0)","v":0},{"$f":"SUM(E134:E153)","v":0},{"$f":"SUM(E114:E153)","v":0},null,40,{"$f":"MAX(IF(D$42=TRUE,'Entretien des écrans boisés'!S65),IF(F$42=TRUE,'Entretien des écrans boisés'!Q65),IF(H$42=TRUE,(IF(Questionnaire!$C$114=TRUE,M$39*K153,MIN(M$39*I153,D$45))),IF(J$42=TRUE,MIN(M$38*I153,D$45))))","v":0}]

{"sheet":"Pertes de sol","index":23,"n_rows":139,"n_cols":10,"rows_kept":139,"cut":false,"hidden":false,"merged":[[96,6,97,6],[41,5,42,9],[34,0,34,1],[35,0,35,1],[36,0,36,1],[42,0,42,2],[39,0,39,2],[40,0,40,2],[41,0,41,2],[96,0,97,2],[96,4,97,5],[7,4,7,5],[12,2,12,3],[12,4,12,5],[13,2,13,3],[13,4,13,5],[10,2,10,3],[10,4,10,5],[11,2,11,3],[11,4,11,5],[98,0,98,1],[98,4,98,5],[0,0,0,9],[3,1,5,1],[3,2,5,3],[3,4,5,5],[3,6,5,6],[3,7,5,7],[3,8,5,8],[8,2,8,3],[8,4,8,5],[9,2,9,3],[9,4,9,5],[6,2,6,3],[6,4,6,5],[7,2,7,3]]}
[]
[]
[]
[null,"Période","Améliorations",null,"Détériorations",null,"Marge","Marge actualisée ","Marge actualisée accumulée"]
[]
[]
[null,"0-5 ans",{"$f":"$C104","v":0},null,0,null,{"$f":"C7+E7","v":0},{"$f":"F104","v":0},{"$f":"F104","v":0}," "]
[]
[null,"5-10 ans",{"$f":"$C109","v":0},null,0,null,{"$f":"C9+E9","v":0},{"$f":"F109","v":0},{"$f":"G109","v":0}]
[]
[null,"10-20 ans",{"$f":"$C119","v":0},null,0,null,{"$f":"C11+E11","v":0},{"$f":"F119","v":0},{"$f":"G119","v":0}]
[]
[null,"20-40 ans",{"$f":"$C139","v":0},null,0,null,{"$f":"C13+E13","v":0},{"$f":"F139","v":0},{"$f":"G139","v":0}]
[]
[]
[]
[]
[]
[]
[]
[]
[]
[]
[]
[]
[]
[]
[]
[]
[]
[]
[]
[]
[]
["Rangée 1",null,"CON",{"$f":"IF('Devis d''implantation des écrans'!F42>0,TRUE,FALSE)","v":false},"PEH",{"$f":"IF('Devis d''implantation des écrans'!F43>0,TRUE,FALSE)","v":false}]
["Rangée 2",null,"CON",{"$f":"IF('Devis d''implantation des écrans'!G42>0,TRUE,FALSE)","v":false},"PEH",{"$f":"IF('Devis d''implantation des écrans'!G43>0,TRUE,FALSE)","v":false}]
["Rangée 3",null,"CON",{"$f":"IF('Devis d''implantation des écrans'!G42>0,TRUE,FALSE)","v":false},"PEH",{"$f":"IF('Devis d''implantation des écrans'!H43>0,TRUE,FALSE)","v":false}]
[]
[]
["Croissance annuelle",null,null,{"$f":"MAX(IF('Devis d''implantation des écrans'!D$43>0,1.5,0),IF(OR('Devis d''implantation des écrans'!D$42>0,'Devis d''implantation des écrans'!D$44),0.5,0),IF('Devis d''implantation des écrans'!D$46>0,1.2,0),IF('Devis d''implantation des écrans'!D$45>0,0.5,0))","v":0},"m"]
["Hauteur maximale de la haie",null,null,{"$f":"MAX(IF('Devis d''implantation des écrans'!D$43>0,Paramètres!I100,0),IF(OR('Devis d''implantation des écrans'!D$42>0,'Devis d''implantation des écrans'!D$44),Paramètres!I101,0),IF('Devis d''implantation des écrans'!D$46>0,Paramètres!I102,0),IF('Devis d''implantation des écrans'!D$45>0,Paramètres!I103,0))","v":0},"m"]
["Protection de culture",null,null,{"$f":"IF(OR(Questionnaire!F144=\"Oui\",Questionnaire!F144=\"Yes\"),1,0)","v":0},null,"Facteur de multiplication qui vaut 1 lorsqu'il y a une protection de culture et vaut 0 lorsqu'il n'y en n'a pas"]
["Valeur ($/ha/année)",null,null,{"$f":"Questionnaire!F138","v":"0"}]
["Longueur de la protection",null,null,{"$f":"Questionnaire!G81","v":0}]
[]
["Perte de sol annuelle (mm)",null,null,0.5]
[null,null,null,null,null,null,"Valeur du sol",50,"par m3"]
[]
[null,"Surface (m2)","Surface (ha)","Volume (m3)","Valeur perte de sol"]
[1,{"$f":"$D$44*Questionnaire!$H$149*MIN($D$40*A50,$D$41)","v":0},{"$f":"B50/10000","v":0},{"$f":"B50*$D$46/1000","v":0},{"$f":"H$47*D50","v":0}]
[2,{"$f":"$D$44*Questionnaire!$H$149*MIN($D$40*A51,$D$41)","v":0},{"$f":"B51/10000","v":0},0,{"$f":"H$47*D51","v":0}]
[3,{"$f":"$D$44*Questionnaire!$H$149*MIN($D$40*A52,$D$41)","v":0},0,0,0]
[4,{"$f":"$D$44*Questionnaire!$H$149*MIN($D$40*A53,$D$41)","v":0},0,0,0]
[5,{"$f":"$D$44*Questionnaire!$H$149*MIN($D$40*A54,$D$41)","v":0},0,0,0]
[6,{"$f":"$D$44*Questionnaire!$H$149*MIN($D$40*A55,$D$41)","v":0},0,0,0]
[7,{"$f":"$D$44*Questionnaire!$H$149*MIN($D$40*A56,$D$41)","v":0},0,0,0]
[8,{"$f":"$D$44*Questionnaire!$H$149*MIN($D$40*A57,$D$41)","v":0},0,0,0]
[9,{"$f":"$D$44*Questionnaire!$H$149*MIN($D$40*A58,$D$41)","v":0},0,0,0]
[10,{"$f":"$D$44*Questionnaire!$H$149*MIN($D$40*A59,$D$41)","v":0},0,0,0]
[11,{"$f":"$D$44*Questionnaire!$H$149*MIN($D$40*A60,$D$41)","v":0},0,0,0]
[12,{"$f":"$D$44*Questionnaire!$H$149*MIN($D$40*A61,$D$41)","v":0},0,0,0]
[13,{"$f":"$D$44*Questionnaire!$H$149*MIN($D$40*A62,$D$41)","v":0},0,0,0]
[14,{"$f":"$D$44*Questionnaire!$H$149*MIN($D$40*A63,$D$41)","v":0},0,0,0]
[15,{"$f":"$D$44*Questionnaire!$H$149*MIN($D$40*A64,$D$41)","v":0},0,0,0]
[16,{"$f":"$D$44*Questionnaire!$H$149*MIN($D$40*A65,$D$41)","v":0},0,0,0]
[17,{"$f":"$D$44*Questionnaire!$H$149*MIN($D$40*A66,$D$41)","v":0},0,0,0]
[18,{"$f":"$D$44*Questionnaire!$H$149*MIN($D$40*A67,$D$41)","v":0},0,0,0]
[19,{"$f":"$D$44*Questionnaire!$H$149*MIN($D$40*A68,$D$41)","v":0},0,0,0]
[20,{"$f":"$D$44*Questionnaire!$H$149*MIN($D$40*A69,$D$41)","v":0},0,0,0]
[21,{"$f":"$D$44*Questionnaire!$H$149*MIN($D$40*A70,$D$41)","v":0},0,0,0]
[22,{"$f":"$D$44*Questionnaire!$H$149*MIN($D$40*A71,$D$41)","v":0},0,0,0]
[23,{"$f":"$D$44*Questionnaire!$H$149*MIN($D$40*A72,$D$41)","v":0},0,0,0]
[24,{"$f":"$D$44*Questionnaire!$H$149*MIN($D$40*A73,$D$41)","v":0},0,0,0]
[25,{"$f":"$D$44*Questionnaire!$H$149*MIN($D$40*A74,$D$41)","v":0},0,0,0]
[26,{"$f":"$D$44*Questionnaire!$H$149*MIN($D$40*A75,$D$41)","v":0},0,0,0]
[27,{"$f":"$D$44*Questionnaire!$H$149*MIN($D$40*A76,$D$41)","v":0},0,0,0]
[28,{"$f":"$D$44*Questionnaire!$H$149*MIN($D$40*A77,$D$41)","v":0},0,0,0]
[29,{"$f":"$D$44*Questionnaire!$H$149*MIN($D$40*A78,$D$41)","v":0},0,0,0]
[30,{"$f":"$D$44*Questionnaire!$H$149*MIN($D$40*A79,$D$41)","v":0},0,0,0]
[31,{"$f":"$D$44*Questionnaire!$H$149*MIN($D$40*A80,$D$41)","v":0},0,0,0]
[32,{"$f":"$D$44*Questionnaire!$H$149*MIN($D$40*A81,$D$41)","v":0},0,0,0]
[33,{"$f":"$D$44*Questionnaire!$H$149*MIN($D$40*A82,$D$41)","v":0},0,0,0]
[34,{"$f":"$D$44*Questionnaire!$H$149*MIN($D$40*A83,$D$41)","v":0},0,0,0]
[35,{"$f":"$D$44*Questionnaire!$H$149*MIN($D$40*A84,$D$41)","v":0},0,0,0]
[36,{"$f":"$D$44*Questionnaire!$H$149*MIN($D$40*A85,$D$41)","v":0},0,0,0]
[37,{"$f":"$D$44*Questionnaire!$H$149*MIN($D$40*A86,$D$41)","v":0},0,0,0]
[38,{"$f":"$D$44*Questionnaire!$H$149*MIN($D$40*A87,$D$41)","v":0},0,0,0]
[39,{"$f":"$D$44*Questionnaire!$H$149*MIN($D$40*A88,$D$41)","v":0},0,0,0]
[40,{"$f":"$D$44*Questionnaire!$H$149*MIN($D$40*A89,$D$41)","v":0},0,0,0]
[]
[]
[]
[]
[]
[]
[]
["Améliorations",null,null,null,"Marge actualisée",null,"Marge actualisée accumulée"]
[]
["total cumulatif à l'an"]
[1,{"$f":"(D$42*C50*D$43)","v":0},null,null,{"$f":"B100/POWER(1+Paramètres!$AF$14,A100)","v":0}]
[2,{"$f":"(D$42*C51*D$43)","v":0},null,null,{"$f":"B101/POWER(1+Paramètres!$AF$14,A101)","v":0}]
[3,0,null,null,{"$f":"B102/POWER(1+Paramètres!$AF$14,A102)","v":0}]
[4,0,null,null,{"$f":"B103/POWER(1+Paramètres!$AF$14,A103)","v":0}]
[5,0,{"$f":"SUM(B100:B104)","v":0},null,{"$f":"B104/POWER(1+Paramètres!$AF$14,A104)","v":0},{"$f":"SUM(E100:E104)","v":0}]
[6,0,null,null,{"$f":"B105/POWER(1+Paramètres!$AF$14,A105)","v":0}]
[7,0,null,null,{"$f":"B106/POWER(1+Paramètres!$AF$14,A106)","v":0}]
[8,0,null,null,{"$f":"B107/POWER(1+Paramètres!$AF$14,A107)","v":0}]
[9,0,null,null,{"$f":"B108/POWER(1+Paramètres!$AF$14,A108)","v":0}]
[10,0,{"$f":"SUM(B105:B109)","v":0},null,{"$f":"B109/POWER(1+Paramètres!$AF$14,A109)","v":0},{"$f":"SUM(E105:E109)","v":0},{"$f":"SUM(E100:E109)","v":0}]
[11,0,null,null,{"$f":"B110/POWER(1+Paramètres!$AF$14,A110)","v":0}]
[12,0,null,null,{"$f":"B111/POWER(1+Paramètres!$AF$14,A111)","v":0}]
[13,0,null,null,{"$f":"B112/POWER(1+Paramètres!$AF$14,A112)","v":0}]
[14,0,null,null,{"$f":"B113/POWER(1+Paramètres!$AF$14,A113)","v":0}]
[15,0,null,null,{"$f":"B114/POWER(1+Paramètres!$AF$14,A114)","v":0}]
[16,0,null,null,{"$f":"B115/POWER(1+Paramètres!$AF$14,A115)","v":0}]
[17,0,null,null,{"$f":"B116/POWER(1+Paramètres!$AF$14,A116)","v":0}]
[18,0,null,null,{"$f":"B117/POWER(1+Paramètres!$AF$14,A117)","v":0}]
[19,0,null,null,{"$f":"B118/POWER(1+Paramètres!$AF$14,A118)","v":0}]
[20,0,{"$f":"SUM(B110:B119)","v":0},null,{"$f":"B119/POWER(1+Paramètres!$AF$14,A119)","v":0},{"$f":"SUM(E110:E119)","v":0},{"$f":"SUM(E100:E119)","v":0}]
[21,0,null,null,{"$f":"B120/POWER(1+Paramètres!$AF$14,A120)","v":0}]
[22,0,null,null,{"$f":"B121/POWER(1+Paramètres!$AF$14,A121)","v":0}]
[23,0,null,null,{"$f":"B122/POWER(1+Paramètres!$AF$14,A122)","v":0}]
[24,0,null,null,{"$f":"B123/POWER(1+Paramètres!$AF$14,A123)","v":0}]
[25,0,null,null,{"$f":"B124/POWER(1+Paramètres!$AF$14,A124)","v":0}]
[26,0,null,null,{"$f":"B125/POWER(1+Paramètres!$AF$14,A125)","v":0}]
[27,0,null,null,{"$f":"B126/POWER(1+Paramètres!$AF$14,A126)","v":0}]
[28,0,null,null,{"$f":"B127/POWER(1+Paramètres!$AF$14,A127)","v":0}]
[29,0,null,null,{"$f":"B128/POWER(1+Paramètres!$AF$14,A128)","v":0}]
[30,0,null,null,{"$f":"B129/POWER(1+Paramètres!$AF$14,A129)","v":0}]
[31,0,null,null,{"$f":"B130/POWER(1+Paramètres!$AF$14,A130)","v":0}]
[32,0,null,null,{"$f":"B131/POWER(1+Paramètres!$AF$14,A131)","v":0}]
[33,0,null,null,{"$f":"B132/POWER(1+Paramètres!$AF$14,A132)","v":0}]
[34,0,null,null,{"$f":"B133/POWER(1+Paramètres!$AF$14,A133)","v":0}]
[35,0,null,null,{"$f":"B134/POWER(1+Paramètres!$AF$14,A134)","v":0}]
[36,0,null,null,{"$f":"B135/POWER(1+Paramètres!$AF$14,A135)","v":0}]
[37,0,null,null,{"$f":"B136/POWER(1+Paramètres!$AF$14,A136)","v":0}]
[38,0,null,null,{"$f":"B137/POWER(1+Paramètres!$AF$14,A137)","v":0}]
[39,0,null,null,{"$f":"B138/POWER(1+Paramètres!$AF$14,A138)","v":0}]
[40,0,{"$f":"SUM(B120:B139)","v":0},null,{"$f":"B139/POWER(1+Paramètres!$AF$14,A139)","v":0},{"$f":"SUM(E120:E139)","v":0},{"$f":"SUM(E100:E139)","v":0}]

{"sheet":"Crédits carbone","index":24,"n_rows":142,"n_cols":18,"rows_kept":142,"cut":false,"hidden":false,"merged":[[33,7,33,8],[99,6,100,6],[41,4,41,5],[40,7,40,8],[41,7,41,8],[34,7,34,8],[36,4,37,5],[36,7,37,8],[74,2,74,7],[32,7,32,8],[29,3,29,4],[30,3,30,4],[31,3,31,4],[32,3,32,4],[0,0,0,9],[3,1,5,1],[3,2,5,3],[3,4,5,5],[3,6,5,6],[3,7,5,7],[3,8,5,8],[6,2,6,3],[6,4,6,5],[7,2,7,3],[7,4,7,5],[8,2,8,3],[8,4,8,5],[9,2,9,3],[9,4,9,5],[10,2,10,3],[10,4,10,5],[11,2,11,3],[11,4,11,5],[12,2,12,3],[12,4,12,5],[13,2,13,3],[13,4,13,5],[99,0,100,2],[99,4,100,5],[49,0,50,0],[76,0,77,0],[76,3,77,3],[76,5,79,5],[21,4,22,4],[27,3,28,4],[21,3,22,3],[21,5,22,5],[33,3,33,4],[38,4,38,5],[78,0,79,0],[78,3,79,3],[101,0,101,1],[101,4,101,5],[16,1,18,8],[21,7,22,7],[76,6,79,6],[76,7,79,7],[21,8,22,8],[27,7,28,8],[21,6,22,6],[38,7,38,8],[40,4,40,5],[29,7,29,8],[30,7,30,8],[31,7,31,8]]}
[]
[]
[null,null,null,null,null,null,null,null,null,null,null,"Tableau synthèse"]
[null,"Période","Améliorations",null,"Détériorations",null,"Marge","Marge actualisée ","Marge actualisée accumulée"]
[]
[]
[null,"0-5 ans",{"$f":"$C107","v":0},null,0,null,{"$f":"C7+E7","v":0},{"$f":"F107","v":0},{"$f":"F107","v":0}]
[]
[null,"5-10 ans",{"$f":"$C112","v":0},null,0,null,{"$f":"C9+E9","v":0},{"$f":"F112","v":0},{"$f":"G112","v":0}]
[]
[null,"10-20 ans",{"$f":"$C122","v":0},null,0,null,{"$f":"C11+E11","v":0},{"$f":"F122","v":0},{"$f":"G122","v":0}]
[]
[null,"20-40 ans",{"$f":"$C142","v":0},null,0,null,{"$f":"C13+E13","v":0},{"$f":"F142","v":0},{"$f":"G142","v":0}]
[]
[]
[]
[null,"CO2 (kg/ha) = [(Biomasse totale (m3/ha) * Densité anhydre du bois (kg sec/m3))* Carbone/mat sec (kg/kg)] * CO2/Carbone (kg/kg)]+  [C contenu dans la litière et le bois mort (kg/ha)( la litière n'est pas tenu en compte dans notre calcul)]"]
[]
[]
[]
[]
["Calcul du volume de bois",null,null,"Volume marchand","Facteur de conversion pour la biomasse total",null,null,null,"biomasse totale ","Taux de conversion total ajusté à 1.6 ( Pajot à 1.6 et logiciel TimberCAM à 1.63 de moyenne entre bois dur et bois mou)"]
[]
["CON",null,null,{"$f":"'Calcul du rendement en bois'!G36","v":0},1.6,null,null,null,{"$f":"D24*E24","v":0},"m3","À la récolte"]
["PEH",null,null,{"$f":"'Calcul du rendement en bois'!G37","v":0},1.6,null,null,null,{"$f":"D25*E25","v":0},"m3","À la récolte"]
["FNO",null,null,{"$f":"'Calcul du rendement en bois'!G38","v":0},1.6,null,null,null,{"$f":"D26*E26","v":0},"m3","À la récolte"]
[]
["Calcul de la matière sèche",null,null,"Densité anhydre du bois (kg/m3)",null,null,null,"Matière sèche total (tonne)"]
[]
["CON",null,null,463,null,null,null,{"$f":"(I24*D30/1000)","v":0},null,"Référence TimberCAM bois mou"]
["PEH",null,null,424,null,null,null,{"$f":"(I25*D31/1000)","v":0},null,"Référence Jean Nolet communication personnelle voir"]
["FNO",null,null,600,null,null,null,{"$f":"(I26*D32/1000)","v":0},null,"Référence TimberCAM bois dur"]
["SAH",null,null,null,null,null,null,{"$f":"'Calcul du rendement en bois'!G40","v":0},null,"Références: Michel  Labrecque communication personnelle"]
["ARB",null,null,null,null,null,null,{"$f":"'Calcul du rendement en bois'!G39","v":0},null,"Référence: Kort et Turnock (1996) , on a supposé 0,06 tonne par arbuste (Caragana) (partie aérienne)"]
[null,null,null,null,null,null,"Total",{"$f":"SUM(H30:I34)","v":0}]
[]
["Calcul du contenu en carbone de la masse anhydre ",null,null,null,"Pourcentage de C/tonne de matière sèche",null,null,"Contenu en C (tonne)"]
[]
["Pour la biomasse totale",null,null,null,0.5,null,"Total",{"$f":"H35*E39","v":0}]
[]
["Calcul de l'équivalent en tonne de CO2/ tonne de C",null,null,null,"Facteur de conversion",null,null,"Contenu en CO2 (tonne)"]
[null,null,null,null,3.67,null,"Total",{"$f":"P61","v":0}]
[]
["Les calculs sont basés sur les données récoltées et pour les arbres, extrapolé à 40 ans"]
["Arbustes",null,null,null,null,null,null,null,"Par rangée : CO2-c accumulée 10 ans. C'est basé sur un espacement de 2-3m, et donc un maximum est prévu par rangée si les arbres sont espacés à moins de 2m,mettre valeur ."]
[null,null,"CO2-C par arbuste (kg)",null,null,null,"Total arbre rangée?",null,"R1","R2","R3","R4","R5","R6","R7","Total"]
["Arbuste","Aménagement","Aérien","Racinaire","Sol","Total/arbuste","si plus <2m;kg/m","espacement pour compter nb arbuste"]
["ARB","BR",{"$f":"L81/1.6","v":12.5},{"$f":"0.6*C48","v":7.5},null,{"$f":"E48+D48+C48","v":20},{"$f":"F48*500/1000","v":10},2,{"$f":"IF(Questionnaire!$AN$25=0,0,IF(Questionnaire!$AX$25>$H48,Questionnaire!$AZ$25*'Crédits carbone'!$F48,'Crédits carbone'!$G48*Questionnaire!$AV$25*Questionnaire!$E$16))","v":0},{"$f":"IF(Questionnaire!$AN$26=0,0,IF(Questionnaire!$AX$26>$H48,Questionnaire!$AZ$26*'Crédits carbone'!$F48,'Crédits carbone'!$G48*Questionnaire!$AV$26*Questionnaire!$E$16))","v":0},{"$f":"IF(Questionnaire!$AN$27=0,0,IF(Questionnaire!$AX$27>$H48,Questionnaire!$AZ$27*'Crédits carbone'!$F48,'Crédits carbone'!$G48*Questionnaire!$AV$27*Questionnaire!$E$16))","v":0},{"$f":"IF(Questionnaire!$AN$28=0,0,IF(Questionnaire!$AX$28>$H48,Questionnaire!$AZ$28*'Crédits carbone'!$F48,'Crédits carbone'!$G48*Questionnaire!$AV$28*Questionnaire!$E$16))","v":0},{"$f":"IF(Questionnaire!$AN$29=0,0,IF(Questionnaire!$AX$29>$H48,Questionnaire!$AZ$29*'Crédits carbone'!$F48,'Crédits carbone'!$G48*Questionnaire!$AV$29*Questionnaire!$E$16))","v":0},{"$f":"IF(Questionnaire!$AN$30=0,0,IF(Questionnaire!$AX$30>$H48,Questionnaire!$AZ$30*'Crédits carbone'!$F48,'Crédits carbone'!$G48*Questionnaire!$AV$30*Questionnaire!$E$16))","v":0},{"$f":"IF(Questionnaire!$AN$31=0,0,IF(Questionnaire!$AX$31>$H48,Questionnaire!$AZ$31*'Crédits carbone'!$F48,'Crédits carbone'!$G48*Questionnaire!$AV$31*Questionnaire!$E$16))","v":0},{"$f":"SUM(I48:O48)","v":0}]
["ARB","HBV",{"$f":"M81/1.6","v":18.75},{"$f":"0.6*C49","v":11.25},null,{"$f":"E49+D49+C49","v":30},{"$f":"F49*500/1000","v":15},2,{"$f":"IF(Questionnaire!$AN$25=0,0,IF(Questionnaire!$AX$25>$H49,Questionnaire!$AZ$25*'Crédits carbone'!$F49,'Crédits carbone'!$G49*Questionnaire!$AV$25*Questionnaire!$E$16))","v":0},{"$f":"IF(Questionnaire!$AN$26=0,0,IF(Questionnaire!$AX$26>$H49,Questionnaire!$AZ$26*'Crédits carbone'!$F49,'Crédits carbone'!$G49*Questionnaire!$AV$26*Questionnaire!$E$16))","v":0},{"$f":"IF(Questionnaire!$AN$27=0,0,IF(Questionnaire!$AX$27>$H49,Questionnaire!$AZ$27*'Crédits carbone'!$F49,'Crédits carbone'!$G49*Questionnaire!$AV$27*Questionnaire!$E$16))","v":0},{"$f":"IF(Questionnaire!$AN$28=0,0,IF(Questionnaire!$AX$28>$H49,Questionnaire!$AZ$28*'Crédits carbone'!$F49,'Crédits carbone'!$G49*Questionnaire!$AV$28*Questionnaire!$E$16))","v":0},{"$f":"IF(Questionnaire!$AN$29=0,0,IF(Questionnaire!$AX$29>$H49,Questionnaire!$AZ$29*'Crédits carbone'!$F49,'Crédits carbone'!$G49*Questionnaire!$AV$29*Questionnaire!$E$16))","v":0},{"$f":"IF(Questionnaire!$AN$30=0,0,IF(Questionnaire!$AX$30>$H49,Questionnaire!$AZ$30*'Crédits carbone'!$F49,'Crédits carbone'!$G49*Questionnaire!$AV$30*Questionnaire!$E$16))","v":0},{"$f":"IF(Questionnaire!$AN$31=0,0,IF(Questionnaire!$AX$31>$H49,Questionnaire!$AZ$31*'Crédits carbone'!$F49,'Crédits carbone'!$G49*Questionnaire!$AV$31*Questionnaire!$E$16))","v":0},{"$f":"SUM(I49:O49)","v":0},null,{"$f":"250*F48","v":5000}]
["Simulation actuelle",{"$f":"IF('Menu simulation'!H6=TRUE,\"HBV\",(IF('Menu simulation'!H8=TRUE,\"HBV\",\"BR\")))","v":"BR"},null,null,null,null,null,{"$f":"B50","v":"BR"},{"$f":"IF($B$50=$B$48,I48,I49)","v":0},{"$f":"IF($B$50=$B$48,J48,J49)","v":0},0,0,0,0,0,0,null,{"$f":"250*F49","v":7500}]
[null,null,null,null,null,null,null,null,"Par rangée : CO2-c accumulée 40 ans et 20 ans PEH. C'est basé sur un espacement de 3m, et donc un maximum est prévu par rangée si les arbres sont espacés à moins de 3m."]
["Arbres","Année","Aérien","Racinaire","Sol","Total/arbre","si plus <3m et sans arbuste;kg/m",null,"R1","R2","R3","R4","R5","R6","R7","Total"]
["CON",40,{"$f":"G98/1.25","v":1200},{"$f":"G98-C53","v":300},null,{"$f":"E53+D53+C53","v":1500},{"$f":"F53*(100/3)/100","v":500},2,{"$f":"IF(Questionnaire!$AM$25=0,0,IF(OR(Questionnaire!$AX$25>=$H53,Questionnaire!$BA$25=1),Questionnaire!$AY$25*Questionnaire!$AR$25*'Crédits carbone'!$F53,'Crédits carbone'!$G53*(Questionnaire!$AY$25*Questionnaire!$AR$25)/(Questionnaire!$AY$25*Questionnaire!$AU$25)*Questionnaire!$E$16))","v":0},{"$f":"IF(Questionnaire!$AM$26=0,0,IF(OR(Questionnaire!$AX$26>=$H53,Questionnaire!$BA$26=1),Questionnaire!$AY$26*Questionnaire!$AR$26*'Crédits carbone'!$F53,'Crédits carbone'!$G53*(Questionnaire!$AY$26*Questionnaire!$AR$26)/(Questionnaire!$AY$26*Questionnaire!$AU$26)*Questionnaire!$E$16))","v":0},{"$f":"IF(Questionnaire!$AM$27=0,0,IF(OR(Questionnaire!$AX$27>=$H53,Questionnaire!$BA$27=1),Questionnaire!$AY$27*Questionnaire!$AR$27*'Crédits carbone'!$F53,'Crédits carbone'!$G53*(Questionnaire!$AY$27*Questionnaire!$AR$27)/(Questionnaire!$AY$27*Questionnaire!$AU$27)*Questionnaire!$E$16))","v":0},{"$f":"IF(Questionnaire!$AM$28=0,0,IF(OR(Questionnaire!$AX$28>=$H53,Questionnaire!$BA$28=1),Questionnaire!$AY$28*Questionnaire!$AR$28*'Crédits carbone'!$F53,'Crédits carbone'!$G53*(Questionnaire!$AY$28*Questionnaire!$AR$28)/(Questionnaire!$AY$28*Questionnaire!$AU$28)*Questionnaire!$E$16))","v":0},{"$f":"IF(Questionnaire!$AM$29=0,0,IF(OR(Questionnaire!$AX$29>=$H53,Questionnaire!$BA$29=1),Questionnaire!$AY$29*Questionnaire!$AR$29*'Crédits carbone'!$F53,'Crédits carbone'!$G53*(Questionnaire!$AY$29*Questionnaire!$AR$29)/(Questionnaire!$AY$29*Questionnaire!$AU$29)*Questionnaire!$E$16))","v":0},{"$f":"IF(Questionnaire!$AM$30=0,0,IF(OR(Questionnaire!$AX$30>=$H53,Questionnaire!$BA$30=1),Questionnaire!$AY$30*Questionnaire!$AR$30*'Crédits carbone'!$F53,'Crédits carbone'!$G53*(Questionnaire!$AY$30*Questionnaire!$AR$30)/(Questionnaire!$AY$30*Questionnaire!$AU$30)*Questionnaire!$E$16))","v":0},{"$f":"IF(Questionnaire!$AM$31=0,0,IF(OR(Questionnaire!$AX$31>=$H53,Questionnaire!$BA$31=1),Questionnaire!$AY$31*Questionnaire!$AR$31*'Crédits carbone'!$F53,'Crédits carbone'!$G53*(Questionnaire!$AY$31*Questionnaire!$AR$31)/(Questionnaire!$AY$31*Questionnaire!$AU$31)*Questionnaire!$E$16))","v":0},{"$f":"SUM(I53:O53)","v":0}]
["PEH",40,{"$f":"G97/1.25","v":2080},{"$f":"G97-C54","v":520},null,{"$f":"E54+D54+C54","v":2600},{"$f":"F54*(100/3)/100","v":866.66666666666674},2,{"$f":"IF(Questionnaire!$AK25=0,0,IF('Calcul du rendement en bois'!$N$18=1,0,(IF(OR(Questionnaire!$AX$25>=$H54,Questionnaire!$BA$25=1),Questionnaire!$AY$25*Questionnaire!$AP$25*'Crédits carbone'!$F54,'Crédits carbone'!$G54*(Questionnaire!$AY$25*Questionnaire!$AP$25)/(Questionnaire!$AY$25*Questionnaire!$AU$25)*Questionnaire!$E$16))))","v":0},{"$f":"IF(Questionnaire!$AK26=0,0,IF('Calcul du rendement en bois'!O18=1,0,(IF(OR(Questionnaire!$AX$26>=$H54,Questionnaire!$BA$26=1),Questionnaire!$AY$26*Questionnaire!$AP$26*'Crédits carbone'!$F54,'Crédits carbone'!$G54*(Questionnaire!$AY$26*Questionnaire!$AP$26)/(Questionnaire!$AY$26*Questionnaire!$AU$26)*Questionnaire!$E$16))))","v":0},{"$f":"IF(Questionnaire!$AK$27=0,0,IF('Calcul du rendement en bois'!P18=1,0,(IF(OR(Questionnaire!$AX$27>=$H54,Questionnaire!$BA$27=1),Questionnaire!$AY$27*Questionnaire!$AP$27*'Crédits carbone'!$F54,'Crédits carbone'!$G54*(Questionnaire!$AY$27*Questionnaire!$AP$27)/(Questionnaire!$AY$27*Questionnaire!$AU$27)*Questionnaire!$E$16))))","v":0},{"$f":"IF(Questionnaire!$AK$28=0,0,IF('Calcul du rendement en bois'!Q18=1,0,(IF(OR(Questionnaire!$AX$28>=$H54,Questionnaire!$BA$28=1),Questionnaire!$AY$28*Questionnaire!$AP$28*'Crédits carbone'!$F54,'Crédits carbone'!$G54*(Questionnaire!$AY$28*Questionnaire!$AP$28)/(Questionnaire!$AY$28*Questionnaire!$AU$28)*Questionnaire!$E$16))))","v":0},{"$f":"IF(Questionnaire!$AK$29=0,0,IF('Calcul du rendement en bois'!R18=1,0,(IF(OR(Questionnaire!$AX$29>=$H54,Questionnaire!$BA$29=1),Questionnaire!$AY$29*Questionnaire!$AP$29*'Crédits carbone'!$F54,'Crédits carbone'!$G54*(Questionnaire!$AY$29*Questionnaire!$AP$29)/(Questionnaire!$AY$29*Questionnaire!$AU$29)*Questionnaire!$E$16))))","v":0},{"$f":"IF(Questionnaire!$AK$30=0,0,IF('Calcul du rendement en bois'!S18=1,0,(IF(OR(Questionnaire!$AX$30>=$H54,Questionnaire!$BA$30=1),Questionnaire!$AY$30*Questionnaire!$AP$30*'Crédits carbone'!$F54,'Crédits carbone'!$G54*(Questionnaire!$AY$30*Questionnaire!$AP$30)/(Questionnaire!$AY$30*Questionnaire!$AU$30)*Questionnaire!$E$16))))","v":0},{"$f":"IF(Questionnaire!$AK$31=0,0,IF('Calcul du rendement en bois'!T18=1,0,(IF(OR(Questionnaire!$AX$31>=$H54,Questionnaire!$BA$31=1),Questionnaire!$AY$31*Questionnaire!$AP$31*'Crédits carbone'!$F54,'Crédits carbone'!$G54*(Questionnaire!$AY$31*Questionnaire!$AP$31)/(Questionnaire!$AY$31*Questionnaire!$AU$31)*Questionnaire!$E$16))))","v":0},{"$f":"SUM(I54:O54)","v":0}]
["PEH",20,{"$f":"G93/1.25","v":960},{"$f":"G93-C55","v":240},null,{"$f":"E55+D55+C55","v":1200},{"$f":"F55*(100/3)/100","v":400},2,{"$f":"IF(Questionnaire!$AK$25=0,0,IF('Calcul du rendement en bois'!N$18=0,0,(IF(OR(Questionnaire!$AX$25>=$H55,Questionnaire!$BA$25=1),Questionnaire!$AY$25*Questionnaire!$AP$25*'Crédits carbone'!$F55,'Crédits carbone'!$G55*(Questionnaire!$AY$25*Questionnaire!$AP$25)/(Questionnaire!$AY$25*Questionnaire!$AU$25)*Questionnaire!$E$16))))","v":0},{"$f":"IF(Questionnaire!$AK27=0,0,IF('Calcul du rendement en bois'!O18=0,0,(IF(OR(Questionnaire!$AX$26>=$H55,Questionnaire!$BA$26=1),Questionnaire!$AY$26*Questionnaire!$AP$26*'Crédits carbone'!$F55,'Crédits carbone'!$G55*(Questionnaire!$AY$26*Questionnaire!$AP$26)/(Questionnaire!$AY$26*Questionnaire!$AU$26)*Questionnaire!$E$16))))","v":0},{"$f":"IF(Questionnaire!$AK$27=0,0,IF('Calcul du rendement en bois'!P18=0,0,(IF(OR(Questionnaire!$AX$27>=$H55,Questionnaire!$BA$27=1),Questionnaire!$AY$27*Questionnaire!$AP$27*'Crédits carbone'!$F55,'Crédits carbone'!$G55*(Questionnaire!$AY$27*Questionnaire!$AP$27)/(Questionnaire!$AY$27*Questionnaire!$AU$27)*Questionnaire!$E$16))))","v":0},{"$f":"IF(Questionnaire!$AK$28=0,0,IF('Calcul du rendement en bois'!Q18=0,0,(IF(OR(Questionnaire!$AX$28>=$H55,Questionnaire!$BA$28=1),Questionnaire!$AY$28*Questionnaire!$AP$28*'Crédits carbone'!$F55,'Crédits carbone'!$G55*(Questionnaire!$AY$28*Questionnaire!$AP$28)/(Questionnaire!$AY$28*Questionnaire!$AU$28)*Questionnaire!$E$16))))","v":0},{"$f":"IF(Questionnaire!$AK$29=0,0,IF('Calcul du rendement en bois'!R18=0,0,(IF(OR(Questionnaire!$AX$29>=$H55,Questionnaire!$BA$29=1),Questionnaire!$AY$29*Questionnaire!$AP$29*'Crédits carbone'!$F55,'Crédits carbone'!$G55*(Questionnaire!$AY$29*Questionnaire!$AP$29)/(Questionnaire!$AY$29*Questionnaire!$AU$29)*Questionnaire!$E$16))))","v":0},{"$f":"IF(Questionnaire!$AK$30=0,0,IF('Calcul du rendement en bois'!S18=0,0,(IF(OR(Questionnaire!$AX$30>=$H55,Questionnaire!$BA$30=1),Questionnaire!$AY$30*Questionnaire!$AP$30*'Crédits carbone'!$F55,'Crédits carbone'!$G55*(Questionnaire!$AY$30*Questionnaire!$AP$30)/(Questionnaire!$AY$30*Questionnaire!$AU$30)*Questionnaire!$E$16))))","v":0},{"$f":"IF(Questionnaire!$AK$31=0,0,IF('Calcul du rendement en bois'!T18=0,0,(IF(OR(Questionnaire!$AX$31>=$H55,Questionnaire!$BA$31=1),Questionnaire!$AY$31*Questionnaire!$AP$31*'Crédits carbone'!$F55,'Crédits carbone'!$G55*(Questionnaire!$AY$31*Questionnaire!$AP$31)/(Questionnaire!$AY$31*Questionnaire!$AU$31)*Questionnaire!$E$16))))","v":0},{"$f":"SUM(I55:O55)","v":0}]
["FNO",40,{"$f":"G99/1.3","v":1307.6923076923076},{"$f":"G99-C56","v":392.30769230769238},null,{"$f":"E56+D56+C56","v":1700},{"$f":"F56*(100/3)/100","v":566.66666666666674},3,{"$f":"IF(Questionnaire!$AL$25=0,0,IF(Questionnaire!$AX$25>=$H56,Questionnaire!$AY$25*Questionnaire!$AQ$25*'Crédits carbone'!$F56,'Crédits carbone'!$G56*(Questionnaire!$AY$25*Questionnaire!$AQ$25)/(Questionnaire!$AY$25*Questionnaire!$AU$25)*Questionnaire!$E$16))","v":0},{"$f":"IF(Questionnaire!$AL$26=0,0,IF(Questionnaire!$AX$26>=$H56,Questionnaire!$AY$26*Questionnaire!$AQ$26*'Crédits carbone'!$F56,'Crédits carbone'!$G56*(Questionnaire!$AY$26*Questionnaire!$AQ$26)/(Questionnaire!$AY$26*Questionnaire!$AU$26)*Questionnaire!$E$16))","v":0},{"$f":"IF(Questionnaire!$AL$27=0,0,IF(Questionnaire!$AX$27>=$H56,Questionnaire!$AY$27*Questionnaire!$AQ$27*'Crédits carbone'!$F56,'Crédits carbone'!$G56*(Questionnaire!$AY$27*Questionnaire!$AQ$27)/(Questionnaire!$AY$27*Questionnaire!$AU$27)*Questionnaire!$E$16))","v":0},{"$f":"IF(Questionnaire!$AL$28=0,0,IF(Questionnaire!$AX$28>=$H56,Questionnaire!$AY$28*Questionnaire!$AQ$28*'Crédits carbone'!$F56,'Crédits carbone'!$G56*(Questionnaire!$AY$28*Questionnaire!$AQ$28)/(Questionnaire!$AY$28*Questionnaire!$AU$28)*Questionnaire!$E$16))","v":0},{"$f":"IF(Questionnaire!$AL$29=0,0,IF(Questionnaire!$AX$29>=$H56,Questionnaire!$AY$29*Questionnaire!$AQ$29*'Crédits carbone'!$F56,'Crédits carbone'!$G56*(Questionnaire!$AY$29*Questionnaire!$AQ$29)/(Questionnaire!$AY$29*Questionnaire!$AU$29)*Questionnaire!$E$16))","v":0},{"$f":"IF(Questionnaire!$AL$30=0,0,IF(Questionnaire!$AX$30>=$H56,Questionnaire!$AY$30*Questionnaire!$AQ$30*'Crédits carbone'!$F56,'Crédits carbone'!$G56*(Questionnaire!$AY$30*Questionnaire!$AQ$30)/(Questionnaire!$AY$30*Questionnaire!$AU$30)*Questionnaire!$E$16))","v":0},{"$f":"IF(Questionnaire!$AL$31=0,0,IF(Questionnaire!$AX$31>=$H56,Questionnaire!$AY$31*Questionnaire!$AQ$31*'Crédits carbone'!$F56,'Crédits carbone'!$G56*(Questionnaire!$AY$31*Questionnaire!$AQ$31)/(Questionnaire!$AY$31*Questionnaire!$AU$31)*Questionnaire!$E$16))","v":0},{"$f":"SUM(I56:O56)","v":0}]
[null,null,null,null,null,null,null,null,"même chose pour le SAH, un maximum de CO2 par rangé. Si plant espacé de moins de x m, valeur si 3m. Si plus espacés, ajusté par nombre de tige réels. Jusqu'à 3m, valeur maximale atteinte"]
["SAH",null,{"$f":"O77/1.6","v":25},{"$f":"O77-C58","v":15},null,{"$f":"E58+D58+C58","v":40},{"$f":"F58*(100/2)/100","v":20},2,{"$f":"IF(Questionnaire!$AO$25=0,0,IF(Questionnaire!$AX$25>$H58,Questionnaire!$AY$25*Questionnaire!$AT$25*'Crédits carbone'!$F58,'Crédits carbone'!$G58*(Questionnaire!$AY$25*Questionnaire!$AT$25)/(Questionnaire!$AY$25*Questionnaire!$AU$25)*Questionnaire!$E$16))","v":0},{"$f":"IF(Questionnaire!$AO$26=0,0,IF(Questionnaire!$AX$26>$H58,Questionnaire!$AY$26*Questionnaire!$AT$26*'Crédits carbone'!$F58,'Crédits carbone'!$G58*(Questionnaire!$AY$26*Questionnaire!$AT$26)/(Questionnaire!$AY$26*Questionnaire!$AU$26)*Questionnaire!$E$16))","v":0},{"$f":"IF(Questionnaire!$AO$27=0,0,IF(Questionnaire!$AX$27>$H58,Questionnaire!$AY$27*Questionnaire!$AT$27*'Crédits carbone'!$F58,'Crédits carbone'!$G58*(Questionnaire!$AY$27*Questionnaire!$AT$27)/(Questionnaire!$AY$27*Questionnaire!$AU$27)*Questionnaire!$E$16))","v":0},{"$f":"IF(Questionnaire!$AO$28=0,0,IF(Questionnaire!$AX$28>$H58,Questionnaire!$AY$28*Questionnaire!$AT$28*'Crédits carbone'!$F58,'Crédits carbone'!$G58*(Questionnaire!$AY$28*Questionnaire!$AT$28)/(Questionnaire!$AY$28*Questionnaire!$AU$28)*Questionnaire!$E$16))","v":0},{"$f":"IF(Questionnaire!$AO$29=0,0,IF(Questionnaire!$AX$29>$H58,Questionnaire!$AY$29*Questionnaire!$AT$29*'Crédits carbone'!$F58,'Crédits carbone'!$G58*(Questionnaire!$AY$29*Questionnaire!$AT$29)/(Questionnaire!$AY$29*Questionnaire!$AU$29)*Questionnaire!$E$16))","v":0},{"$f":"IF(Questionnaire!$AO$30=0,0,IF(Questionnaire!$AX$30>$H58,Questionnaire!$AY$30*Questionnaire!$AT$30*'Crédits carbone'!$F58,'Crédits carbone'!$G58*(Questionnaire!$AY$30*Questionnaire!$AT$30)/(Questionnaire!$AY$30*Questionnaire!$AU$30)*Questionnaire!$E$16))","v":0},{"$f":"IF(Questionnaire!$AO$31=0,0,IF(Questionnaire!$AX$31>$H58,Questionnaire!$AY$31*Questionnaire!$AT$31*'Crédits carbone'!$F58,'Crédits carbone'!$G58*(Questionnaire!$AY$31*Questionnaire!$AT$31)/(Questionnaire!$AY$31*Questionnaire!$AU$31)*Questionnaire!$E$16))","v":0},{"$f":"SUM(I58:O58)","v":0}]
[]
[null,null,null,null,null,null,null,"Total rangée",{"$f":"I50+I53+I54+I55+I56+I58","v":0},{"$f":"J50+J53+J54+J55+J56+J58","v":0},0,0,0,0,0,0]
[null,null,null,null,null,null,null,"Total tonne",{"$f":"I60/1000","v":0},{"$f":"J60/1000","v":0},0,0,0,0,0,0,"tonne total"]
[]
["Pour le sol"]
["Pour le sol","% mat org",null,"densité estimée",null,"épaisseur"]
[null,"haie","agricole"]
[]
[]
[]
[]
[]
[]
["Arbustes"]
["Valeurs issues des compilations du rapport",null,null,null,null,null,null,null,null,"Calucl des moyenne et valeurs retenues pour le simulateur pour les arbustes"]
[]
[null,null,"Arbustes",null,null,null,null,null,null,null,null,"kg/arbuste"]
["Sol","Aménagement","Aronie noire","Cerisier de Virginie","Physocarpe","Rosier rugueux","Viorne trilobée","Saule hybride",null,null,null,"BR","HBV",null,"SAH"]
["Argile","Bande riveraine",4,7,18,22,13,44,null,"Tests","Argile",{"$f":"(C77+D77+E77+F77+G77)/5","v":12.8},{"$f":"(C78+D77+E78+F77+G77)/5","v":20.399999999999999},null,40]
[null,"Haie brise-vent",10,null,50,null,null,null,null,null,"Loam sablonneux",{"$f":"(C79+D79+E79+F77+G77)/5","v":20.2},{"$f":"(C80+D79+E80+F77+G77)/5","v":33}]
["Loam sablonneux","Bande riveraine",12,36,18,null,null,null,null,null,"Total",{"$f":"(C77+D77+E77+F77+G77+C79+D79+E79+F77+G77)/10","v":16.5},{"$f":"(C78+D77+E78+F77+G77+C80+D79+E80+F77+G77)/10","v":26.7},{"$f":"(C77+C78+D77+D77+E77+E78+F77+F77+G77+G77+C79+C80+D79+D79+E79+E80+F77+F77+G77+G77)/20","v":21.6}]
[null,"Haie brise-vent",44,null,50,null,null,null,null,null,null,null,null,{"$f":"(L79+M79)/2","v":21.6}]
[null,null,null,null,null,null,null,null,null,null,"estimé",20,30]
[]
["différente façon de calculé si espacé de moins de 2m ? En supposant qu'il rentre 500 plants dans 1000 m, on peut calculer par mettre et faire X la proportion d'arbuste dans la bande?"]
[]
[]
[]
["Pour les arbres, données tirées du rapport et des formules"]
["Selon données utilisées",null,"Co2 total à 40 ans"]
[null,"Espacement","C linéaire","Calcul avec évolution de DHP/hauteur",null,null,null,"Remarque"]
["ERS","3-4 m",1043.037855,1596,1.7024137111063689,null,null,"DHP 36 cm ; H 16m",null,null,null,null,null,1043.037855,1775.6819455549767,1.7024137111063689]
["Frênes","3-4 m",789.2902181818182,998,1.3245381387250903,null,null,"DHP 37 cm ; h18",null,null,null,null,null,789.2902181818182,1045.444996504466,1.3245381387250903]
["Chênes","3-4 m",1230.8390393939396,1758,1.3427722420648602,null,null,"DHP 38 cm ; H 17",null,null,null,null,null,1230.8390393939396,1983.283795857551,1.6113266904778323]
["PEH (20 ans)","3-4 m",1220.2976308933132,null,null,null,{"$f":"MROUND(C93,100)","v":1200},"DHP40 ; H 20m",null,null,null,null,null,2745.6696695099549]
["EPB","3m",896.2510523200001,1472,1.7325950900699072,null,null,"DHP 40; H 17",null,null,null,null,null,896.2510523200001,1552.8401727196197,1.7325950900699072]
["EPO","3m",919.33047856000019,1486,1.6890989790221269,null,null,"DHP40; H 17",null,null,null,null,null,919.33047856000019,1552.8401727196197,1.6890989790221269]
["MEL","3m (loam sableux)",1094.3271532654162,1501,1.3242989779229615,null,null,"DHP40; H20",null,null,null,null,null,1094.3271532654162,1449.2163305827346,1.3242989779229615]
["PEH 40 ans",null,{"$f":"562*3.67+141*3.67","v":2580.0100000000002},2745,null,null,{"$f":"MROUND(C97,100)","v":2600},"valeur similaire avec les données mesurées que formules de KORT; 60 cm"]
["CON",null,{"$f":"AVERAGE(C94,C95,C96)","v":969.96956138180542},{"$f":"AVERAGE(D94,D95,D96)","v":1486.3333333333333},null,"retenue",{"$f":"MROUND(D98,100)","v":1500}]
["FNO",null,{"$f":"AVERAGE(C90,C92)","v":1136.9384471969697},{"$f":"AVERAGE(D90,D92)","v":1677},null,"retenue",{"$f":"MROUND(D99,100)","v":1700}]
["Améliorations",null,null,null,"Marge actualisée",null,"Marge actualisée accumulée"]
[]
["total cumulatif à l'an"]
[1,{"$f":"$H$42*Questionnaire!$G$155","v":0},null,null,{"$f":"B103/POWER(1+Paramètres!$AF$14,A103)","v":0}]
[2,null,null,null,{"$f":"B104/POWER(1+Paramètres!$AF$14,A104)","v":0}]
[3,null,null,null,{"$f":"B105/POWER(1+Paramètres!$AF$14,A105)","v":0}]
[4,null,null,null,{"$f":"B106/POWER(1+Paramètres!$AF$14,A106)","v":0}]
[5,null,{"$f":"SUM(B103:B107)","v":0},null,{"$f":"B107/POWER(1+Paramètres!$AF$14,A107)","v":0},{"$f":"SUM(E103:E107)","v":0}]
[6,null,null,null,{"$f":"B108/POWER(1+Paramètres!$AF$14,A108)","v":0}]
[7,null,null,null,{"$f":"B109/POWER(1+Paramètres!$AF$14,A109)","v":0}]
[8,null,null,null,{"$f":"B110/POWER(1+Paramètres!$AF$14,A110)","v":0}]
[9,null,null,null,{"$f":"B111/POWER(1+Paramètres!$AF$14,A111)","v":0}]
[10,null,{"$f":"SUM(B108:B112)","v":0},null,{"$f":"B112/POWER(1+Paramètres!$AF$14,A112)","v":0},{"$f":"SUM(E108:E112)","v":0},{"$f":"SUM(E103:E112)","v":0}]
[11,null,null,null,{"$f":"B113/POWER(1+Paramètres!$AF$14,A113)","v":0}]
[12,null,null,null,{"$f":"B114/POWER(1+Paramètres!$AF$14,A114)","v":0}]
[13,null,null,null,{"$f":"B115/POWER(1+Paramètres!$AF$14,A115)","v":0}]
[14,null,null,null,{"$f":"B116/POWER(1+Paramètres!$AF$14,A116)","v":0}]
[15,null,null,null,{"$f":"B117/POWER(1+Paramètres!$AF$14,A117)","v":0}]
[16,null,null,null,{"$f":"B118/POWER(1+Paramètres!$AF$14,A118)","v":0}]
[17,null,null,null,{"$f":"B119/POWER(1+Paramètres!$AF$14,A119)","v":0}]
[18,null,null,null,{"$f":"B120/POWER(1+Paramètres!$AF$14,A120)","v":0}]
[19,null,null,null,{"$f":"B121/POWER(1+Paramètres!$AF$14,A121)","v":0}]
[20,null,{"$f":"SUM(B113:B122)","v":0},null,{"$f":"B122/POWER(1+Paramètres!$AF$14,A122)","v":0},{"$f":"SUM(E113:E122)","v":0},{"$f":"SUM(E103:E122)","v":0}]
[21,null,null,null,{"$f":"B123/POWER(1+Paramètres!$AF$14,A123)","v":0}]
[22,null,null,null,{"$f":"B124/POWER(1+Paramètres!$AF$14,A124)","v":0}]
[23,null,null,null,{"$f":"B125/POWER(1+Paramètres!$AF$14,A125)","v":0}]
[24,null,null,null,{"$f":"B126/POWER(1+Paramètres!$AF$14,A126)","v":0}]
[25,null,null,null,{"$f":"B127/POWER(1+Paramètres!$AF$14,A127)","v":0}]
[26,null,null,null,{"$f":"B128/POWER(1+Paramètres!$AF$14,A128)","v":0}]
[27,null,null,null,{"$f":"B129/POWER(1+Paramètres!$AF$14,A129)","v":0}]
[28,null,null,null,{"$f":"B130/POWER(1+Paramètres!$AF$14,A130)","v":0}]
[29,null,null,null,{"$f":"B131/POWER(1+Paramètres!$AF$14,A131)","v":0}]
[30,null,null,null,{"$f":"B132/POWER(1+Paramètres!$AF$14,A132)","v":0}]
[31,null,null,null,{"$f":"B133/POWER(1+Paramètres!$AF$14,A133)","v":0}]
[32,null,null,null,{"$f":"B134/POWER(1+Paramètres!$AF$14,A134)","v":0}]
[33,null,null,null,{"$f":"B135/POWER(1+Paramètres!$AF$14,A135)","v":0}]
[34,null,null,null,{"$f":"B136/POWER(1+Paramètres!$AF$14,A136)","v":0}]
[35,null,null,null,{"$f":"B137/POWER(1+Paramètres!$AF$14,A137)","v":0}]
[36,null,null,null,{"$f":"B138/POWER(1+Paramètres!$AF$14,A138)","v":0}]
[37,null,null,null,{"$f":"B139/POWER(1+Paramètres!$AF$14,A139)","v":0}]
[38,null,null,null,{"$f":"B140/POWER(1+Paramètres!$AF$14,A140)","v":0}]
[39,null,null,null,{"$f":"B141/POWER(1+Paramètres!$AF$14,A141)","v":0}]
[40,null,{"$f":"SUM(B123:B142)","v":0},null,{"$f":"B142/POWER(1+Paramètres!$AF$14,A142)","v":0},{"$f":"SUM(E123:E142)","v":0},{"$f":"SUM(E103:E142)","v":0}]

{"sheet":"tableau synthèse","index":25,"n_rows":19,"n_cols":8,"rows_kept":19,"cut":false,"hidden":false,"merged":[]}
[null,"Espèces d'arbres","Marge cumulative actualisée après 5 ans ($)","Marge cumulative actualisée après 10 ans ($)","Marge cumulative actualisée après 20 ans ($)","Marge cumulative actualisée après 40 ans ($)","Délai de récupération (années)"]
[1,"Arbustes fruitiers",-2048.4133925984738,-1819.0015247942954,-1320.4929975556422,-226.65400372814656," + de 40 ans"]
[1,"Feuillus nobles",-2604.5299602018063,-3581.1494073332015,-4614.0940433497944,118.58836522065212,40]
[1,"Feuillus nobles et arbustes",-2580.1230874766607,-3226.6212525007822,-3761.8099034661395,320.4443908459848,40]
[1,"Peupliers hybrides et feuillus nobles",-2778.6318409642786,-4056.7345980177652,-3377.4771912460619,35.21882922547411,40,"1 récolte de PEH"]
[1,"Saules hybrides",-2008.13172882393,-1456.1797182971704,-324.2299605383123,1991.232790510142,22,"1 récolte la 3ième année"]
[2,"Feuillus nobles",-3710.5258548055581,-5522.8167542471656,-4737.6392761216666,-473.61918473261903,40,"1 récolte de PEH, pas d'essouchage"]
[null,"Peupliers hybrides"]
[2,"Feuillus nobles",-3970.2919329961142,-5803.3747848461417,-7825.2221047508174,1652.1054472164178,40]
[null,"Feuillus nobles"]
[2,"Feuillus nobles",-3554.7982441610129,-4103.6150791518212,-4200.4654917399075,2602.4021140253117,40,"1 récolte la 3ième année"]
[null,"Saules hybrides"]
[3,"Feuillus nobles",-5336.0539057904207,-8025.6001623590801,-11036.35016615184,3185.6225292121926,40]
[null,"Feuillus nobles"]
[null,"Feuillus nobles"]
[3,"Saules hybrides",-3714.3539093737118,-2306.7966745657786,697.34153005009102,7153.1746754880969,17,"1 récolte la 3ième année"]
[null,"Saules hybrides"]
[null,"Saules hybrides"]
[1,"Résultats de simulation en cours",{"$f":"'Bilan des calculs'!L12","v":-75.822548140182846},{"$f":"'Bilan des calculs'!L13","v":-75.822548140182846},{"$f":"'Bilan des calculs'!L14","v":-75.822548140182846},{"$f":"'Bilan des calculs'!L15","v":-75.822548140182846},{"$f":"'Bilan des calculs'!F98","v":"> 40"}]

{"sheet":"Administrateurs","index":26,"n_rows":2,"n_cols":2,"rows_kept":2,"cut":false,"hidden":false,"merged":[[1,1,2,8]]}
[]
[null,"Administrateurs de programme"]

{"sheet":"Modèles de haies","index":27,"n_rows":66,"n_cols":10,"rows_kept":66,"cut":false,"hidden":false,"merged":[[63,5,65,5],[63,6,65,6],[63,7,65,7],[63,8,65,8],[59,5,61,5],[59,6,61,6],[59,7,61,7],[59,8,61,8],[55,5,57,5],[55,6,57,6],[55,7,57,7],[55,8,57,8],[52,5,53,5],[52,6,53,6],[52,7,53,7],[52,8,53,8],[49,5,50,5],[49,6,50,6],[49,7,50,7],[49,8,50,8],[46,5,47,5],[46,6,47,6],[46,7,47,7],[46,8,47,8],[31,3,31,4],[31,7,32,8],[0,0,0,9],[43,5,44,5],[43,6,44,6],[43,7,44,7],[43,8,44,8]]}
[]
["Numéro de modèle de haie","Nombre de rangées","Distance entre les rangées (m)","Distance entre les arbres (m)","Espèces d'arbres","rapidité de croissance (m/an)","production de bois (B) ou de petits fruits (Fr)","réduction des coûts de chauffage","réduction des coûts de déneigement","remarques"]
[1,1,null,3,"Épinettes,  pins ou thuyas",0.5,null,"Oui","Oui"]
[2,1,null,2,"Peupliers hybrides et épinettes",null,"B","Oui","Oui"]
[3,1,null,2,"Feuillus nobles et arbustes",null,"B et Fr","Non","Oui *"]
[4,1,null,2,"Arbustes",0.5,"Fr","Non","Oui *","Utiles lorsqu'il y a des contraintes en hauteur"]
[]
[5,2,3,3,"Peupliers hybrides",1,"B","Non","Oui *"]
[null,null,null,3,"Épinettes,  pins ou thuyas",0.5,null,"Oui","Oui"]
[]
[6,2,3,3,"Feuillus nobles",0.5,"B","Non","Oui *"]
[null,null,null,3,"Épinettes,  pins ou thuyas",0.5,null,"Oui","Oui"]
[]
[7,2,3,2,"Peupliers hybrides et épinettes  ",null,"B","Oui","Oui"]
[null,null,null,3,"Feuillus nobles",0.5,"B","Non","Oui *"]
[]
[8,2,3,2,"Peupliers hybrides et épinettes  ",null,"B","Oui","Oui"]
[null,null,null,2,"Feuillus nobles et arbustes",null,"B et Fr","Non","Oui *"]
[]
[9,3,3,3,"Peupliers hybrides",1,"B","Non","Oui *"]
[null,null,null,3,"Épinettes,  pins ou thuyas",0.5,null,"Oui","Oui"]
[null,null,null,2,"Feuillus nobles et arbustes",null,"B et Fr","Non","Oui *"]
[]
[10,3,3,3,"Peupliers hybrides",1,"B","Non","Oui *"]
[null,null,null,3,"Épinettes,  pins ou thuyas",0.5,null,"Oui","Oui"]
[null,null,null,3,"Feuillus nobles",0.5,"B","Non","Oui *"]
[]
[11,3,3,3,"Feuillus nobles",0.5,"B","Non","Oui *"]
[null,null,null,3,"Épinettes,  pins ou thuyas",0.5,null,"Oui","Oui"]
[null,null,null,2,"Arbustes",0.5,"Fr","Non","Oui *"]
[]
[null,null,null,"RETOUR AU DEVIS",null,null,null,"  * de façon moindre qu'avec des résineux"]
[]
[]
[]
[]
[]
["Numéro de modèle de haie","Nombre de rangées","Distance entre les rangées (m)","Distance entre les arbres (m)","Espèces d'arbres","Largeur à 5 ans","Largeur à 10 ans","Largeur à 20 ans","Largeur à 40 ans"]
[1,1,null,3,"Épinettes,  pins ou thuyas",2,4,5,8]
[2,1,null,2,"Peupliers hybrides et épinettes",2,4,5,8]
[3,1,null,2,"Feuillus nobles et arbustes",2,3,3,3]
[4,1,null,2,"Arbustes",2,3,3,3]
[]
[5,2,3,3,"Peupliers hybrides",5,6,7,8]
[null,null,null,3,"Épinettes,  pins ou thuyas"]
[]
[6,2,3,3,"Feuillus nobles",5,6,7,9]
[null,null,null,3,"Épinettes,  pins ou thuyas"]
[]
[7,2,3,2,"Peupliers hybrides et épinettes  ",5,6,7,9]
[null,null,null,3,"Feuillus nobles"]
[]
[8,2,3,2,"Peupliers hybrides et épinettes  ",5,6,7,9]
[null,null,null,2,"Feuillus nobles et arbustes"]
[]
[9,3,3,3,"Peupliers hybrides",8,9,10,10]
[null,null,null,3,"Épinettes,  pins ou thuyas"]
[null,null,null,2,"Feuillus nobles et arbustes"]
[]
[10,3,3,3,"Peupliers hybrides",8,9,10,10]
[null,null,null,3,"Épinettes,  pins ou thuyas"]
[null,null,null,3,"Feuillus nobles"]
[]
[11,3,3,3,"Feuillus nobles",8,9,10,10]
[null,null,null,3,"Épinettes,  pins ou thuyas"]
[null,null,null,2,"Arbustes"]

{"sheet":"Références espace cultivable","index":28,"n_rows":50,"n_cols":9,"rows_kept":50,"cut":false,"hidden":false,"merged":[[0,0,0,3],[1,0,1,3]]}
[]
[" (Selon les budgets 2006 de Guy Beauregard et André Brunelle, agronomes au MAPAQ de Nicolet)"]
[]
["CULTURE","RENDEMENT","Prix stabilisé","MARGE ","Marge avec protection de culture (évaluation moyenne à partir des bidgets 2006 de M. Beauregard)"]
[null,"KG / HA","$ la tonne","$/Ha","$/Ha",null,null,"Augmentation"]
["1. GRAINS",null,null,null,0.1,0.05]
["1- Soya  sans intrants chimiques   (Prix stabilisé +  80 $/t)",2880,403.11,649.45000000000005]
["2- Pois de conserverie ",4000,311,538.66999999999996]
["3- Canola   (avec fumier)",2200,470.57,517.23]
["4- Fève de couleur",2100,600,392.41,{"$f":"(D10*(1+H10))-D10","v":113.7989},{"$f":"E10/2","v":56.899450000000002},null,0.28999999999999998]
["5- Orge de brasserie 2 rangs  (Prix stabilisé + 25 $/t)",3500,269.58999999999997,354.07,0,0]
["6- Orge de brasserie 6 rangs (Prix stabilisé + 15 $/t)",3500,259.58999999999997,339.07,40.688400000000058,20.344200000000029,null,0.12]
["7- Maïs-grain  (semis direct)",8500,203.33,334.72,0,0]
["8- Soya  semis direct (Prix stabilisé sans prime)",3000,323.11,305.3,0,0]
["9- Blé fourrager",3400,275.55,301.66000000000003,39.215799999999945,19.607899999999972,null,0.13]
["10- Blé d'alimentation humaine",3550,301.26,297.14,0,0]
["11- Maïs-grain  (compensation ASRA 2006:  68,33 $/t)",8500,203.33,294.47000000000003,76.562200000000018,38.281100000000009,null,0.26]
["12- Avoine nue (Prix stabilisé + 50 $ /t)",2250,301.31,292.39,32.162900000000036,16.081450000000018,null,0.11]
["13- Avoine semis direct",3000,251.31,289.54000000000002,0,0]
["14- Soya  (Prix stabilisé sans prime)",3000,323.11,275.13,71.533799999999985,35.766899999999993,null,0.26]
["15- Avoine non grainée",3100,251.31,267.32,0,0]
["16- Soya  avec prime  (Prix stabilisé +  85 $/t)",2250,408.11,266.72000000000003,0,0]
["17- Orge  utilisée comme plante-abri",2600,244.59,214.92,0,0]
["18- Avoine  utilisée comme plante-abri",2250,251.31,213.67,0,0]
["19- Orge non grainée",3500,244.59,208.33,0,0]
["20- Lin pour la graine",1800,360,169.17,0,0]
["21- Maïs-grain humide vendu récolte (Prix du marché 67.00 $ + compensation)",10400,135.33000000000001,146.1,0,0]
["22.- Maïs-grain sec vendu récolte (prix du marché 102.50 $ + compensation)",8500,170.83,139.93,0,0]
["2. FOURRAGES ",null,"Prix / tonne"]
["Maïs fourrager  silo couloir ( 35 % m.s.) (3)",40,50,1270.19,{"$f":"(D30*(1+H30))-D30","v":0},0]
["Maïs fourrager  silo tour ( 35 % m.s.)",40,50,1133.74,294.77240000000006,147.38620000000003,null,0.26,"à confirmer"]
["Pâturage intensif   (89% m.s.)",6,130,500.95,0,0]
["Pâturage en rotation  (89% m.s.)",5.2,130,399.51,0,0]
["Ensilage mil-luzerne en silo couloir  (36% m.s.)",17.8,52.58,386.58,0,0]
["Ensilage mil-luzerne annuelle en silo tour  (40% m.s.)",20,58.5,359.7,0,0]
["Ensilage mil-luzerne en silo-tour (40% m.s.)",16,58.5,356.89,0,0]
["Foin mil-luzerne semis pur  (89% m.s.)",7,130,326.24,0,0]
["Foin mil-luzerne avec orge (89% m.s.)",7,130,289.45,{"$f":"(D38*(1+H38))-D38","v":28.94500000000005},14.472500000000025,null,0.1,"à confirmer"]
["Foin mil-luzerne pour le commerce  (Grosses presses)",6.5,130,281.38,0,0]
["Foin mil-trèfle rouge avec orge (89% m.s.) (balles rondes)",6,130,272.52]
["Ensilage mil-trèfle rouge-balles rondes enrobées (50% m.s.)",10.8,73.03,271.77999999999997]
["Foin mil-brome pour le commerce  (Grosses presses)",7,130,271.41000000000003]
["Foin mil-trèfle rouge avec orge (petites balles rectangulaires)",6,130,221.64]
[]
["N.B. (1) Nous faisons l'hypothèse que toutes les terres et  équipements sont possédés par l'agriculteur."]
["        (2) Les marges varient avec les rendements et les prix obtenus. "]
["        (3) Basé sur un prix du foin de 130 $ la tonne à 89 % de matière sèche."]
[]
["(1)  MARGE PRODUITS SUR DÉBOURS = C'est ce qui reste à l'agriculteur pour vivre et effectuer les remboursements"]
["     sur les emprunts à moyen et à long terme de son entreprise. On parle ici en termes de gestion financière."]

{"sheet":"Référence déneigement","index":29,"n_rows":70,"n_cols":7,"rows_kept":70,"cut":false,"hidden":false,"merged":[[0,0,0,6],[2,0,2,6]]}
[]
[]
["COÛT DU DÉNEIGEMENT PAR L'ÉLEVEUR"]
[]
[]
[null,"Cas no 1","Cas no 2","Cas no 3","Cas no 4","Moyenne","Retenu"]
[null,"Les Élevages Auger","Ferme Pierre Milot"]
[null,"850, chemin des Acadiens","Yamachiche"]
[null,"tél.: 819-697-5360"]
[]
["Tracteur  H.P.",100,95,70,96,{"$f":"AVERAGE(B11:E11)","v":90.25},95]
["kW",{"$f":"B11/1.341","v":74.571215510812834},70.842654735272191,52.199850857568983,71.588366890380314,67.300521998508572,70.842654735272191]
[]
["Nombre de fois",17,15,10,20,{"$f":"AVERAGE(B14:E14)","v":15.5},16]
[]
["Nbre heures/fois (h)",3,{"$f":"40/60","v":0.66666666666666663},3.5,1.5,{"$f":"AVERAGE(B16:E16)","v":2.1666666666666665},{"$f":"G18/G14","v":2}]
[]
["Total (h)",{"$f":"B14*B16","v":51},{"$f":"C14*C16","v":10},{"$f":"D14*D16","v":35},{"$f":"E14*E16","v":30},{"$f":"AVERAGE(B18:E18)","v":31.5},32]
[]
["Litres/h",null,null,{"$f":"250/D18","v":7.1428571428571432}]
[]
["Litres total *",{"$f":"0.223*B12*B18","v":848.09843400447448},{"$f":"0.223*C12*C18","v":157.97912005965699},{"$f":"0.223*D12*D18","v":407.41983594332589},{"$f":"0.223*E12*E18","v":478.92617449664431},{"$f":"AVERAGE(B22:E22)","v":473.10589112602543},{"$f":"0.223*G12*G18","v":505.53318419090238}]
[]
["Coût le litre diesel",0.7,0.7,0.7,0.7,0.7,0.7]
[]
["Salaire opérateur",null,null,15,15]
[]
["CALCULS",null,null,null,null,null,"Retenu"]
[]
["Amortisssement souffleur**",{"$f":"(9800-980)/10","v":882},{"$f":"+B30","v":882},{"$f":"+C30","v":882},{"$f":"+C30","v":882},{"$f":"AVERAGE(B30:E30)","v":882},{"$f":"+F30","v":882}]
[]
["Réparations souffleur"]
["9 800 $ x 4 %=",{"$f":"9800*0.04","v":392},{"$f":"+B33","v":392},{"$f":"+B33","v":392},{"$f":"+B33","v":392},{"$f":"+B33","v":392},{"$f":"+B33","v":392}]
[]
["Amortissement tracteur ***",{"$f":"(95128-9512.8)/10/500*$G$18","v":547.93727999999999},{"$f":"+B35","v":547.93727999999999},{"$f":"+B35","v":547.93727999999999},{"$f":"+B35","v":547.93727999999999},{"$f":"+B35","v":547.93727999999999},{"$f":"+B35","v":547.93727999999999}]
[]
["Réparations tracteur",{"$f":"0.0172*B12*B18","v":65.413870246085011},{"$f":"0.0172*C12*C18","v":12.184936614466817},{"$f":"0.0172*D12*D18","v":31.424310216256529},{"$f":"0.0172*E12*E18","v":36.939597315436238},{"$f":"AVERAGE(B37:E37)","v":36.490678598061152},{"$f":"0.0172*G12*G18","v":38.991797166293814}]
[]
["Carburant ",{"$f":"B22*B24","v":593.66890380313214},{"$f":"C22*C24","v":110.58538404175989},{"$f":"D22*D24","v":285.19388516032808},{"$f":"E22*E24","v":335.24832214765098},{"$f":"AVERAGE(B39:E39)","v":331.17412378821774},{"$f":"G22*G24","v":353.87322893363165}]
[]
["Huile x 15 %",{"$f":"B39*0.15","v":89.050335570469812},{"$f":"C39*0.15","v":16.587807606263983},{"$f":"D39*0.15","v":42.779082774049208},{"$f":"E39*0.15","v":50.287248322147647},{"$f":"AVERAGE(B41:E41)","v":49.676118568232667},{"$f":"G39*0.15","v":53.080984340044743}]
[]
["Opérateur 15 $/h",{"$f":"B18*15","v":765},{"$f":"C18*15","v":150},{"$f":"D18*15","v":525},{"$f":"E18*15","v":450},{"$f":"AVERAGE(B43:E43)","v":472.5},{"$f":"G18*15","v":480}]
[null,"-------------","-------------","-------------","-------------","-------------","-------------"]
["Total",{"$f":"SUM(B30:B43)","v":3335.0703896196874},{"$f":"SUM(C30:C43)","v":2111.295408262491},{"$f":"SUM(D30:D43)","v":2706.3345581506337},{"$f":"SUM(E30:E43)","v":2694.4124477852351},{"$f":"AVERAGE(B45:E45)","v":2711.7782009545117},{"$f":"SUM(G30:G43)","v":2747.8832904399701}]
[]
[]
[null,"Minimum",{"$f":"MIN(B45:E45)","v":2111.295408262491}]
[null,"Maximum",{"$f":"MAX(B45:E45)","v":3335.0703896196874}]
[null,"Moyenne",{"$f":"+G45","v":2747.8832904399701},{"$f":"G45/G14","v":171.74270565249813}," /fois",{"$f":"C50/G18","v":85.871352826249066}," /heure"]
[]
["* Consommation de carburant: travail moyen; utilise 60 % de la puissance de la prise de force."]
["** Amortissement du souffleur: coût à l'achat  9 800 $ moins valeur de récupération 980 $ divisé par 10 ans."]
["*** Amortissement du tracteur: coût d'achat d'un tracteur de 90 H.P. moins sa valeur de récupération divisé"]
["   par 10 ans. Le tracteur est utilisé 500 heures par an. Coût du tracteur: 95 128 $"]
[]
[]
["Commentaires:"]
["   Il en coûte environ 2 750 $/an pour déneiger les alentours d'une porcherie et son "]
["chemin d'accès."]
[]
[]
[null,"c:\\guy\\déneigement écrans boisés.xls"]
[]
[]
[]
["Nicolet, 20 juillet 2006",null,null,null,null,null,"Guy Beauregrad, agr., M.Sc."]
[null,null,null,null,null,null,"Conseiller régional en Économie et"]
[null,null,null,null,null,null,"développement du bioalimentaire"]
[null,null,null,null,null,null,"MAPAQ"]

{"sheet":"Questionnaire saule","index":30,"n_rows":499,"n_cols":9,"rows_kept":499,"cut":false,"hidden":false,"merged":[[498,1,498,7],[482,1,482,7],[28,1,28,5],[31,1,31,5],[34,1,34,5],[37,1,37,2],[54,1,54,4],[68,1,68,4],[200,1,200,7],[224,1,224,7],[466,1,466,7],[450,1,450,7],[402,1,402,7],[386,1,386,7],[434,1,434,7],[418,1,418,7],[275,1,275,7],[338,1,338,7],[354,1,354,7],[370,1,370,7],[289,1,289,7],[306,1,306,7],[322,1,322,7],[1,1,1,8],[168,1,168,7],[184,1,184,7],[79,1,80,3],[152,1,152,7],[149,1,149,5],[14,1,14,5],[22,1,22,5],[25,1,25,5],[60,1,60,2],[38,1,38,2],[48,1,48,2],[49,1,49,2],[63,4,63,5],[61,4,61,5],[62,4,62,5],[266,1,266,7],[240,1,240,7],[17,1,17,5],[71,1,71,4],[74,1,74,4],[47,1,47,2],[55,1,55,4],[61,1,61,2],[62,1,62,2],[63,1,63,2]]}
[]
[null,{"$f":"IF(Langue!$A$200 = \"FR\",Dictionnaire!A303,Dictionnaire!B303)","v":"Questionnaire Saule"}]
[]
[null,"\n"]
[]
[null," "]
[]
[]
[]
[]
[]
[]
[null,{"$f":"IF(Langue!$A$200 = \"FR\",Dictionnaire!A305,Dictionnaire!B305)","v":"Section 1 : Paramètres économiques"}]
[]
[null,{"$f":"IF(Langue!$A$200 = \"FR\",Dictionnaire!A306,Dictionnaire!B306)","v":"Taux d'intérêt du dernier emprunt (%)"},null,null,null,null,0.06]
[]
[]
[null,{"$f":"IF(Langue!$A$200 = \"FR\",Dictionnaire!A307,Dictionnaire!B307)","v":"Coût d'opportunité annuel ($/ha)"},null,null,null,null,100]
[]
[]
[null,{"$f":"IF(Langue!$A$200 = \"FR\",Dictionnaire!A309,Dictionnaire!B309)","v":"Section 2 : Implantation"}]
[]
[null,{"$f":"IF(Langue!$A$200 = \"FR\",Dictionnaire!A310,Dictionnaire!B310)","v":"Superficie du champ"},null,null,null,null,0,"ha"]
[]
[]
[null,{"$f":"IF(Langue!$A$200 = \"FR\",Dictionnaire!A311,Dictionnaire!B311)","v":"Nombre de plants par hectare"},null,null,null,null,16160]
[]
[]
[null,{"$f":"IF(Langue!$A$200 = \"FR\",Dictionnaire!A312,Dictionnaire!B312)","v":"Abouts de champ (% de la superficie totale)"},null,null,null,null,0.08]
[]
[]
[null,{"$f":"IF(Langue!$A$200 = \"FR\",Dictionnaire!A313,Dictionnaire!B313)","v":"Coût des boutures ($)"},null,null,null,null,0.2]
[]
[]
[null,{"$f":"IF(Langue!$A$200 = \"FR\",Dictionnaire!A314,Dictionnaire!B314)","v":"Distance entre le site d'établissement et le point de départ des ouvriers (km)"},null,null,null,null,30]
[]
[]
[null,{"$f":"IF(Langue!$A$200 = \"FR\",Dictionnaire!A315,Dictionnaire!B315)","v":"Préparation du sol"},null,null,null,null,"$/ha"]
[null,{"$f":"IF(Langue!$A$200 = \"FR\",Dictionnaire!A316,Dictionnaire!B316)","v":"(cocher les étapes qui s'appliquent)"},null,null,false,{"$f":"IF(Langue!$A$200 = \"FR\",Dictionnaire!A341,Dictionnaire!B341)","v":"Débroussaillage mécanique"},1500]
[null,null,null,null,false,{"$f":"IF(Langue!$A$200 = \"FR\",Dictionnaire!A342,Dictionnaire!B342)","v":"Application de glyphosate"},100]
[null,null,null,null,false,{"$f":"IF(Langue!$A$200 = \"FR\",Dictionnaire!A343,Dictionnaire!B343)","v":"Épierrement"},195]
[null,null,null,null,false,{"$f":"IF(Langue!$A$200 = \"FR\",Dictionnaire!A344,Dictionnaire!B344)","v":"Sous-solage"},35]
[null,null,null,null,false,{"$f":"IF(Langue!$A$200 = \"FR\",Dictionnaire!A345,Dictionnaire!B345)","v":"Travail primaire du sol"},100]
[null,null,null,null,false,{"$f":"IF(Langue!$A$200 = \"FR\",Dictionnaire!A346,Dictionnaire!B346)","v":"Travail secondaire du sol"},250]
[null,null,null,null,false,{"$f":"IF(Langue!$A$200 = \"FR\",Dictionnaire!A347,Dictionnaire!B347)","v":"Pose de paillis plastique"},1500]
[]
[]
[null,{"$f":"IF(Langue!$A$200 = \"FR\",Dictionnaire!A317,Dictionnaire!B317)","v":"Mode de plantation"},null,null,null,null,"$/ha"]
[null,null,null,null,true,"Mécanique",600]
[null,null,null,null,false,"Manuel",1200]
[]
[]
[null,{"$f":"IF(Langue!$A$200 = \"FR\",Dictionnaire!A319,Dictionnaire!B319)","v":"Section 3 : Entretien de la plantation"}]
[]
[null,{"$f":"IF(Langue!$A$200 = \"FR\",Dictionnaire!A320,Dictionnaire!B320)","v":"Désirez-vous effectuer les activités d'entretien suivantes ?"}]
[null,{"$f":"IF(Langue!$A$200 = \"FR\",Dictionnaire!A321,Dictionnaire!B321)","v":"(cocher les activités qui s'appliquent)"},null,null,null,null,"$/ha"]
[null,null,null,null,false,{"$f":"IF(Langue!$A$200 = \"FR\",Dictionnaire!A349,Dictionnaire!B349)","v":"Recépage"},100]
[null,null,null,null,false,{"$f":"IF(Langue!$A$200 = \"FR\",Dictionnaire!A350,Dictionnaire!B350)","v":"Fertilisation"},200]
[]
[]
[null,{"$f":"IF(Langue!$A$200 = \"FR\",Dictionnaire!A322,Dictionnaire!B322)","v":"Désherbage de la plantation"},null,null,null,null,"$/ha"]
[null,{"$f":"IF(Langue!$A$200 = \"FR\",Dictionnaire!A323,Dictionnaire!B323)","v":"(cocher une seule activité)"},null,null,true,null,30]
[null,null,null,null,false,null,100]
[null,null,null,null,false,null,60]
[]
[]
[null,{"$f":"IF(Langue!$A$200 = \"FR\",Dictionnaire!A325,Dictionnaire!B325)","v":"Section 4 : Récolte"}]
[]
[null,{"$f":"IF(Langue!$A$200 = \"FR\",Dictionnaire!A326,Dictionnaire!B326)","v":"Frais de récolte et conditionnement (incluant transport)"},null,null,null,40,{"$f":"IF(Langue!$A$200 = \"FR\",Dictionnaire!A356,Dictionnaire!B356)","v":"$/tma"}]
[]
[]
[null,{"$f":"IF(Langue!$A$200 = \"FR\",Dictionnaire!A327,Dictionnaire!B327)","v":"Rendement annuel attendu"},null,null,null,12,{"$f":"IF(Langue!$A$200 = \"FR\",Dictionnaire!A357,Dictionnaire!B357)","v":"tma/ha"}]
[]
[]
[null,{"$f":"IF(Langue!$A$200 = \"FR\",Dictionnaire!A328,Dictionnaire!B328)","v":"Prix de vente attendu"},null,null,null,80,{"$f":"IF(Langue!$A$200 = \"FR\",Dictionnaire!A356,Dictionnaire!B356)","v":"$/tma"}]
[]
[]
[null,{"$f":"IF(Langue!$A$200 = \"FR\",Dictionnaire!A330,Dictionnaire!B330)","v":"Section 5 : Crédits de carbone"},null,null,null,null,null,null," "]
[]
[null,{"$f":"IF(Langue!$A$200 = \"FR\",Dictionnaire!A331,Dictionnaire!B331)","v":"À combien évaluez-vous le prix de la réduction d’une tonne des GES ?"},null,null,null,0,{"$f":"IF(Langue!$A$200 = \"FR\",Dictionnaire!A358,Dictionnaire!B358)","v":"$/tonne GES"}]
[]
[]
[]
[]
[]
[]
[]
[]
[]
[]
[]
[]
[]
[]
[]
[]
[]
[]
[]
[]
[]
[]
[]
[]
[]
[]
[]
[]
[]
[]
[]
[]
[]
[]
[]
[]
[]
[]
[]
[]
[]
[]
[]
[]
[]
[]
[]
[]
[]
[]
[]
[]
[]
[]
[]
[]
[]
[]
[]
[]
[]
[]
[]
[]
[]
[]
[]
[]
[]
[null,"Informations"]
[]
[]
[null,{"$f":"B15","v":"Taux d'intérêt du dernier emprunt (%)"}]
[]
[]
[]
[]
[]
[]
[]
[]
[]
[]
[]
[]
[]
[]
[]
[null,{"$f":"B18","v":"Coût d'opportunité annuel ($/ha)"}]
[]
[]
[]
[]
[]
[]
[]
[]
[]
[]
[]
[]
[]
[]
[]
[null,{"$f":"B23","v":"Superficie du champ"}]
[]
[]
[]
[]
[]
[]
[]
[]
[]
[]
[]
[]
[]
[]
[]
[null,{"$f":"B26","v":"Nombre de plants par hectare"}]
[]
[]
[]
[]
[]
[]
[]
[]
[]
[]
[]
[]
[]
[]
[]
[]
[]
[]
[]
[]
[]
[]
[]
[null,{"$f":"B29","v":"Abouts de champ (% de la superficie totale)"}]
[]
[null,null,null,null,null,0]
[]
[null,null,null,null,null,0]
[]
[null,null,null,null,null,0]
[]
[]
[]
[null,null,null,null,null,0]
[]
[]
[]
[]
[]
[null,{"$f":"B32","v":"Coût des boutures ($)"}]
[]
[]
[]
[]
[]
[]
[]
[]
[]
[]
[]
[]
[]
[]
[]
[]
[]
[]
[]
[]
[]
[]
[]
[]
[]
[null,{"$f":"B35","v":"Distance entre le site d'établissement et le point de départ des ouvriers (km)"}]
[]
[]
[]
[]
[]
[]
[]
[]
[null,{"$f":"F39","v":"Débroussaillage mécanique"}]
[]
[]
[]
[]
[]
[]
[]
[]
[]
[]
[]
[]
[]
[null,{"$f":"F40","v":"Application de glyphosate"}]
[]
[]
[]
[]
[]
[]
[]
[]
[]
[]
[]
[]
[]
[]
[]
[]
[null,{"$f":"F41","v":"Épierrement"}]
[]
[]
[]
[]
[]
[]
[]
[]
[]
[]
[]
[]
[]
[]
[]
[null,{"$f":"F42","v":"Sous-solage"}]
[]
[]
[]
[]
[]
[]
[]
[]
[]
[]
[]
[]
[]
[]
[]
[null,{"$f":"F43","v":"Travail primaire du sol"}]
[]
[]
[]
[]
[]
[]
[]
[]
[]
[]
[]
[]
[]
[]
[]
[null,{"$f":"F44","v":"Travail secondaire du sol"}]
[]
[]
[]
[]
[]
[]
[]
[]
[]
[]
[]
[]
[]
[]
[]
[null,{"$f":"F45","v":"Pose de paillis plastique"}]
[]
[]
[]
[]
[]
[]
[]
[]
[]
[]
[]
[]
[]
[]
[]
[null,{"$f":"B48","v":"Mode de plantation"}]
[]
[]
[]
[]
[]
[]
[]
[]
[]
[]
[]
[]
[]
[]
[]
[null,{"$f":"F57","v":"Recépage"}]
[]
[]
[]
[]
[]
[]
[]
[]
[]
[]
[]
[]
[]
[]
[]
[null,{"$f":"F58","v":"Fertilisation"}]
[]
[]
[]
[]
[]
[]
[]
[]
[]
[]
[]
[]
[]
[]
[]
[null,{"$f":"B61","v":"Désherbage de la plantation"}]
[]
[]
[]
[]
[]
[]
[]
[]
[]
[]
[]
[]
[]
[]
[]
[null,{"$f":"B69","v":"Frais de récolte et conditionnement (incluant transport)"}]
[]
[]
[]
[]
[]
[]
[]
[]
[]
[]
[]
[]
[]
[]
[]
[null,{"$f":"B72","v":"Rendement annuel attendu"}]
[]
[]
[]
[]
[]
[]
[]
[]
[]
[]
[]
[]
[]
[]
[]
[null,{"$f":"B75","v":"Prix de vente attendu"}]
[]
[]
[]
[]
[]
[]
[]
[]
[]
[]
[]
[]
[]
[]
[]
[null,{"$f":"B80","v":"À combien évaluez-vous le prix de la réduction d’une tonne des GES ?"}]

{"sheet":"Calculs saule","index":31,"n_rows":44,"n_cols":4,"rows_kept":44,"cut":false,"hidden":false,"merged":[]}
[]
["Taux horaire",60]
["Vitesse moyennes",80,"km/h"]
[]
[]
["Superficie"]
["Superficie totale du champ (ha)",{"$f":"IF('Questionnaire saule'!H23=\"ac\",'Questionnaire saule'!G23/2.471,'Questionnaire saule'!G23)","v":0},"Fait le calcul selon l'unité choisie dans le questionnaire pour remetrre la valeur en ha"]
["Superficie plantée",{"$f":"B7*(1-'Questionnaire saule'!G29)","v":0},"Enlève les abouts de champ"]
[]
[]
[null,null,"Transport","Total"]
[]
["Implantation"]
[]
["Boutures",{"$f":"B8*'Questionnaire saule'!G26*'Questionnaire saule'!G32","v":0},0,{"$f":"B15+C15","v":0}]
[]
["Préparation du sol"]
["Débroussaillage",{"$f":"IF('Questionnaire saule'!E39,$B$8*'Questionnaire saule'!G39,0)","v":0},{"$f":"IF('Questionnaire saule'!E39,(1+('Questionnaire saule'!$G$35*2/$B$3))*$B$2,0)","v":0},{"$f":"B18+C18","v":0}]
["Glyphosate",{"$f":"IF('Questionnaire saule'!E40,$B$8*'Questionnaire saule'!G40,0)","v":0},{"$f":"IF('Questionnaire saule'!E40,(1+('Questionnaire saule'!$G$35*2/$B$3))*$B$2,0)","v":0},0]
["Épierrement",{"$f":"IF('Questionnaire saule'!E41,$B$8*'Questionnaire saule'!G41,0)","v":0},{"$f":"IF('Questionnaire saule'!E41,(1+('Questionnaire saule'!$G$35*2/$B$3))*$B$2,0)","v":0},0]
["Sous-solage",{"$f":"IF('Questionnaire saule'!E42,$B$8*'Questionnaire saule'!G42,0)","v":0},{"$f":"IF('Questionnaire saule'!E42,(1+('Questionnaire saule'!$G$35*2/$B$3))*$B$2,0)","v":0},0]
["Travail primaire du sol",{"$f":"IF('Questionnaire saule'!E43,$B$8*'Questionnaire saule'!G43,0)","v":0},{"$f":"IF('Questionnaire saule'!E43,(1+('Questionnaire saule'!$G$35*2/$B$3))*$B$2,0)","v":0},0]
["Travail secondaire du sol",{"$f":"IF('Questionnaire saule'!E44,$B$8*'Questionnaire saule'!G44,0)","v":0},{"$f":"IF('Questionnaire saule'!E44,(1+('Questionnaire saule'!$G$35*2/$B$3))*$B$2,0)","v":0},0]
["Pose de paillis plastique",{"$f":"IF('Questionnaire saule'!E45,$B$8*'Questionnaire saule'!G45,0)","v":0},{"$f":"IF('Questionnaire saule'!E45,(1+('Questionnaire saule'!$G$35*2/$B$3))*$B$2,0)","v":0},0]
[]
["Plantation",{"$f":"IF('Questionnaire saule'!E49,'Calculs saule'!B8*'Questionnaire saule'!G49,'Calculs saule'!B8*'Questionnaire saule'!G50)","v":0},{"$f":"(1+('Questionnaire saule'!$G$35*2/$B$3))*$B$2","v":105},{"$f":"B26+C26","v":105}]
[]
["Total implantation",{"$f":"SUM(B15:B26)","v":0},{"$f":"SUM(C15:C26)","v":105},{"$f":"SUM(D15:D26)","v":105}]
[]
["Entretien"]
["Recépage (automne année 1)",{"$f":"IF('Questionnaire saule'!E57,$B$8*'Questionnaire saule'!G57,0)","v":0},{"$f":"IF('Questionnaire saule'!E57,(1+('Questionnaire saule'!$G$35*2/$B$3))*$B$2,0)","v":0},{"$f":"B31+C31","v":0}]
["Fertilisation (cyclique)",{"$f":"IF('Questionnaire saule'!E58,$B$8*'Questionnaire saule'!G58,0)","v":0},{"$f":"IF('Questionnaire saule'!E58,(1+('Questionnaire saule'!$G$35*2/$B$3))*$B$2,0)","v":0},{"$f":"B32+C32","v":0}]
["Fauchage (année 1)",{"$f":"IF('Questionnaire saule'!E62,$B$8*'Questionnaire saule'!G62,0)","v":0},{"$f":"IF('Questionnaire saule'!E62,(1+('Questionnaire saule'!$G$35*2/$B$3))*$B$2,0)","v":105},{"$f":"B33+C33","v":105}]
["Désherbage chimique (année 1)",{"$f":"IF('Questionnaire saule'!E63,$B$8*'Questionnaire saule'!G63,0)","v":0},{"$f":"IF('Questionnaire saule'!E63,(1+('Questionnaire saule'!$G$35*2/$B$3))*$B$2,0)","v":0},{"$f":"B34+C34","v":0}]
["Sarclage mécanique (année 1)",{"$f":"IF('Questionnaire saule'!E64,$B$8*'Questionnaire saule'!G64,0)","v":0},{"$f":"IF('Questionnaire saule'!E64,(1+('Questionnaire saule'!$G$35*2/$B$3))*$B$2,0)","v":0},{"$f":"B35+C35","v":0}]
[]
["Récolte",{"$f":"B8*('Questionnaire saule'!F72*3)*'Questionnaire saule'!F69","v":0},{"$f":"(1+('Questionnaire saule'!$G$35*2/$B$3))*$B$2","v":105},{"$f":"B37+C37","v":105}]
["CO2 séquestré (tonnes)",{"$f":"25*15*'Questionnaire saule'!G23","v":0}]
["Revenus"]
["Vente biomasse",{"$f":"'Calculs saule'!B8*('Questionnaire saule'!F72*3)*'Questionnaire saule'!F75","v":0},null,{"$f":"B40+C40","v":0}]
["Crédits carbone",{"$f":"B38*'Questionnaire saule'!$F$80","v":0},0,{"$f":"B41+C41","v":0}]
[]
[]
["Production/rotation (tonnes)",{"$f":"B8*'Questionnaire saule'!F72*3","v":0}]

{"sheet":"Coûts référence","index":32,"n_rows":80,"n_cols":5,"rows_kept":80,"cut":false,"hidden":false,"merged":[[0,0,0,7],[38,0,38,7],[58,0,58,7],[78,0,78,7],[48,0,48,7],[68,0,68,7],[4,0,4,1],[18,0,18,7],[28,0,28,7]]}
[]
[]
["Source: Agro-Énergie -  Liste de prix 2008-2009.doc"]
[]
["Quantité commandée",null,"Boutures coupées de 20 cm"]
[1000,"9999 ",0.4]
[10000,49999,0.3]
[50000,"99999 ",0.25]
[100000,"500000 ",0.2]
[500000,1000000,0.18]
[1000000,"et plus",0.17]
[]
["Nombre de tiges à l'hectare:",null,{"$f":"'Questionnaire saule'!G26","v":16160}]
["Nombre de boutures nécessaires:",null,{"$f":"'Calculs saule'!B8*C13","v":0}]
["Coût des boutures selon la quantité:",null,{"$f":"IF(C14>A11,C11,IF(C14>A10,C10,IF(C14>A9,C9,IF(C14>A8,C8,IF(C14>A7,C7,IF(C14>A6,C6))))))","v":false}]
[]
[]
[]
["Paramètres économiques"]
["Taux d'intérêt dernier emprunt",null,0.06]
["Coût d'opportunité",null,100]
[]
[]
[]
[]
[]
[]
[]
["Implantation"]
["Superficie du champ",null,0,"ha"]
["Nb plants/ha",null,16160]
["Abouts de champ",null,0.08]
["Coût boutures",null,0.2]
["Distance",null,30,"km"]
[]
[]
[]
[]
["Préparation du sol"]
["Débroussaillage mécanique",null,1500,"$/ha","À valider"]
["Application de glyphosate",null,60,"$/ha","Maïs fourrager Budget à l'hectare AGDEX 111/821a 2018"]
["Épierrement",null,80,"$/ha","Machinerie: Coûts d'utilisation et taux à forfait suggérés AGDEX 740/825 2018"]
["Sous-solage",null,105,"$/ha","Machinerie: Coûts d'utilisation et taux à forfait suggérés AGDEX 740/825 2018"]
["Travail primaire du sol",null,115,"$/ha","Machinerie: Coûts d'utilisation et taux à forfait suggérés AGDEX 740/825 2018"]
["Travail secondaire du sol",null,70,"$/ha","Machinerie: Coûts d'utilisation et taux à forfait suggérés AGDEX 740/825 2018"]
["Pose de paillis plastique",null,1500,"$/ha","À valider"]
[]
[]
["Plantation"]
["Mécanique",null,600,"$/ha"]
["Manuelle",null,1200,"$/ha"]
[]
[]
[]
[]
[]
[]
[]
["Entretien"]
["Recépage",null,100,"$/ha"]
["Fertilisation",null,200,"$/ha"]
["Fauchage (année 1)",null,40,"$/ha","Machinerie: Coûts d'utilisation et taux à forfait suggérés AGDEX 740/825 2018"]
["Désherbage chimique (année 1)",null,60,"$/ha","Maïs fourrager Budget à l'hectare AGDEX 111/821a 2018"]
["Sarclage mécanique (année 1)",null,70,"$/ha","Machinerie: Coûts d'utilisation et taux à forfait suggérés AGDEX 740/825 2018"]
[]
[]
[]
[]
["Récolte"]
["Coût récolte",null,40,"$/tma"]
["Rendement",null,12,"tma/ha"]
["Prix vente",null,80,"$/tma"]
[]
[]
[]
[]
[]
[]
["Crédit carbone"]
["Prix crédit carbone 1 tonne GES",null,0,"$/t CO2"]

{"sheet":"Bilan des calculs saule","index":33,"n_rows":317,"n_cols":23,"rows_kept":317,"cut":false,"hidden":false,"merged":[[5,11,6,13],[5,14,6,14],[32,7,32,8],[33,7,33,8],[34,7,34,8],[32,9,32,10],[33,9,33,10],[34,9,34,10],[14,7,14,8],[11,9,11,10],[18,7,18,8],[12,9,12,10],[19,12,19,13],[20,12,20,13],[23,12,23,13],[21,12,21,13],[22,12,22,13],[24,12,24,13],[22,7,22,8],[24,7,24,8],[21,9,21,10],[24,9,24,10],[21,7,21,8],[33,3,33,4],[34,3,34,4],[32,5,32,6],[33,5,33,6],[34,5,34,6],[305,1,305,10],[306,1,306,10],[37,3,37,4],[202,1,202,11],[201,1,201,11],[37,12,37,14],[31,5,31,6],[25,12,25,13],[26,12,26,13],[27,12,27,13],[30,12,30,13],[28,12,28,13],[31,12,31,13],[29,12,29,13],[32,12,32,13],[33,12,33,13],[34,12,34,13],[26,9,26,10],[28,7,28,8],[25,9,25,10],[26,7,26,8],[27,9,27,10],[28,9,28,10],[28,3,28,4],[27,3,27,4],[27,5,27,6],[26,3,26,4],[22,5,22,6],[21,5,21,6],[21,3,21,4],[26,5,26,6],[25,3,25,4],[25,5,25,6],[28,5,28,6],[2,1,2,14],[10,7,10,8],[25,7,25,8],[19,7,19,8],[22,9,22,10],[10,3,10,4],[10,5,10,6],[15,3,15,4],[15,5,15,6],[22,3,22,4],[5,7,6,7],[5,1,6,5],[5,6,6,6],[8,7,9,8],[8,2,9,2],[8,1,9,1],[8,3,9,4],[8,5,9,6],[8,9,9,10],[10,9,10,10],[11,7,11,8],[13,9,13,10],[24,3,24,4],[24,5,24,6],[14,3,14,4],[15,9,15,10],[13,7,13,8],[14,9,14,10],[18,5,18,6],[20,5,20,6],[11,3,11,4],[16,3,16,4],[16,5,16,6],[15,7,15,8],[11,5,11,6],[14,5,14,6],[13,3,13,4],[13,5,13,6],[12,3,12,4],[12,7,12,8],[17,3,17,4],[18,9,18,10],[17,5,17,6],[19,3,19,4],[19,5,19,6],[20,3,20,4],[20,7,20,8],[20,9,20,10],[1,1,1,14],[3,1,3,14],[23,3,23,4],[23,5,23,6],[23,7,23,8],[17,7,17,8],[16,7,16,8],[17,9,17,10],[19,9,19,10],[18,3,18,4],[8,14,9,14],[16,9,16,10],[8,12,9,13],[10,12,10,13],[11,12,11,13],[12,12,12,13],[13,12,13,13],[14,12,14,13],[12,5,12,6],[23,9,23,10],[15,12,15,13],[16,12,16,13],[17,12,17,13],[18,12,18,13],[312,9,312,10],[308,9,309,10],[310,3,310,4],[310,5,310,6],[310,7,310,8],[310,9,310,10],[311,9,311,10],[27,7,27,8],[31,9,31,10],[31,7,31,8],[29,7,29,8],[30,7,30,8],[311,3,311,4],[311,5,311,6],[311,7,311,8],[29,3,29,4],[30,5,30,6],[30,3,30,4],[31,3,31,4],[29,9,29,10],[30,9,30,10],[37,7,37,10],[29,5,29,6],[32,3,32,4],[316,3,316,4],[316,5,316,6],[316,7,316,8],[316,9,316,10],[308,1,309,1],[308,3,309,4],[308,5,309,6],[308,7,309,8],[308,2,309,2],[314,9,314,10],[315,3,315,4],[315,5,315,6],[315,7,315,8],[315,9,315,10],[314,3,314,4],[312,3,312,4],[312,5,312,6],[312,7,312,8],[314,5,314,6],[314,7,314,8],[313,3,313,4],[313,5,313,6],[313,7,313,8],[313,9,313,10]]}
[]
[null,{"$f":"IF(Langue!$A$200 = \"FR\",Dictionnaire!A445,Dictionnaire!B445)","v":"Tableau synthèse de la progression de la marge"}]
[null,{"$f":"IF(Langue!$A$200 = \"FR\",Dictionnaire!A446,Dictionnaire!B446)","v":"actualisée cumulative"}]
[null,{"$f":"IF(Langue!$A$200 = \"FR\",Dictionnaire!A447,Dictionnaire!B447)","v":"(en $ d'aujourd'hui)"}]
[]
[null,{"$f":"IF(Langue!$A$200 = \"FR\",Dictionnaire!A448,Dictionnaire!B448)","v":"Délai de récupération "},null,null,null,null,{"$f":"IF((COUNTIF(J11:K35,\"<0\")+1)>25,\"> 25\",COUNTIF(J11:K35,\"<0\")+1)","v":"> 25"},{"$f":"IF(Langue!$A$200 = \"FR\",Dictionnaire!A449,Dictionnaire!B449)","v":"ans"},null,null,null,{"$f":"IF(Langue!$A$200 = \"FR\",Dictionnaire!A721,Dictionnaire!B721)","v":"Carbone séquestré (tonnes de CO² équivalent) après 25 ans"},null,null,{"$f":"'Calculs saule'!B38","v":0}]
[]
[]
[null,{"$f":"IF(Langue!$A$200 = \"FR\",Dictionnaire!A451,Dictionnaire!B451)","v":"Année"},"Taux d'actualisation",{"$f":"IF(Langue!$A$200 = \"FR\",Dictionnaire!A453,Dictionnaire!B453)","v":"Revenus actualisés"},null,{"$f":"IF(Langue!$A$200 = \"FR\",Dictionnaire!A454,Dictionnaire!B454)","v":"Dépenses actualisées"},null,{"$f":"IF(Langue!$A$200 = \"FR\",Dictionnaire!A455,Dictionnaire!B455)","v":"Marge actualisée"},null,{"$f":"IF(Langue!$A$200 = \"FR\",Dictionnaire!A456,Dictionnaire!B456)","v":"Marge actualisée cumulative"},null,null,{"$f":"IF(Langue!$A$200 = \"FR\",Dictionnaire!A457,Dictionnaire!B457)","v":"Coût d'opportunité"},null,{"$f":"IF(Langue!$A$200 = \"FR\",Dictionnaire!A458,Dictionnaire!B458)","v":"Coût d'opportunité cumulatif"}]
[null,null,null,null,null,null,null,null,null,null,null,null,null,null,null,null,null,null,null,null,0,0,0]
[null,1,{"$f":"(1+('Questionnaire saule'!$G$15-Paramètres!$AF$20))^(B11-1)","v":1},{"$f":"SUM(K206:L206)","v":0},null,{"$f":"SUM(F206:J206)","v":-210},null,{"$f":"D11+F11","v":-210},null,{"$f":"H11","v":-210},null,null,{"$f":"('Questionnaire saule'!G$18*'Questionnaire saule'!G$23)/(1+('Questionnaire saule'!$G$15-Paramètres!$AF$20))^(B11-1)","v":0},null,{"$f":"M11","v":0},null,null,null,null,null,1,{"$f":"J11","v":-210},{"$f":"O11","v":0}]
[null,2,{"$f":"(1+('Questionnaire saule'!$G$15-Paramètres!$AF$20))^(B12-1)","v":1.04},0,null,0,null,0,null,{"$f":"J11+H12","v":-210},null,null,{"$f":"('Questionnaire saule'!G$18*'Questionnaire saule'!G$23)/(1+('Questionnaire saule'!$G$15-Paramètres!$AF$20))^(B12-1)","v":0},null,{"$f":"O11+M12","v":0},null,null,null,null,null,2,-210,0]
[null,3,{"$f":"(1+('Questionnaire saule'!$G$15-Paramètres!$AF$20))^(B13-1)","v":1.0816000000000001},0,null,-97.078402366863898,null,-97.078402366863898,null,-307.07840236686388,null,null,{"$f":"('Questionnaire saule'!G$18*'Questionnaire saule'!G$23)/(1+('Questionnaire saule'!$G$15-Paramètres!$AF$20))^(B13-1)","v":0},null,0,null,null,null,null,null,3,-307.07840236686388,0]
[null,4,{"$f":"(1+('Questionnaire saule'!$G$15-Paramètres!$AF$20))^(B14-1)","v":1.1248640000000001},0,null,0,null,0,null,-307.07840236686388,null,null,{"$f":"('Questionnaire saule'!G$18*'Questionnaire saule'!G$23)/(1+('Questionnaire saule'!$G$15-Paramètres!$AF$20))^(B14-1)","v":0},null,0,null,null,null,null,null,4,-307.07840236686388,0]
[null,5,{"$f":"(1+('Questionnaire saule'!$G$15-Paramètres!$AF$20))^(B15-1)","v":1.1698585600000002},0,null,0,null,0,null,-307.07840236686388,null,null,{"$f":"('Questionnaire saule'!G$18*'Questionnaire saule'!G$23)/(1+('Questionnaire saule'!$G$15-Paramètres!$AF$20))^(B15-1)","v":0},null,0,null,null,null,null,null,5,-307.07840236686388,0]
[null,6,{"$f":"(1+('Questionnaire saule'!$G$15-Paramètres!$AF$20))^(B16-1)","v":1.2166529024000003},0,null,-86.302346209731908,null,-86.302346209731908,null,-393.38074857659581,null,null,{"$f":"('Questionnaire saule'!G$18*'Questionnaire saule'!G$23)/(1+('Questionnaire saule'!$G$15-Paramètres!$AF$20))^(B16-1)","v":0},null,0,null,null,null,null,null,6,-393.38074857659581,0]
[null,7,{"$f":"(1+('Questionnaire saule'!$G$15-Paramètres!$AF$20))^(B17-1)","v":1.2653190184960004},0,null,0,null,0,null,-393.38074857659581,null,null,{"$f":"('Questionnaire saule'!G$18*'Questionnaire saule'!G$23)/(1+('Questionnaire saule'!$G$15-Paramètres!$AF$20))^(B17-1)","v":0},null,0,null,null,null,null,null,7,-393.38074857659581,0]
[null,8,{"$f":"(1+('Questionnaire saule'!$G$15-Paramètres!$AF$20))^(B18-1)","v":1.3159317792358403},0,null,0,null,0,null,-393.38074857659581,null,null,{"$f":"('Questionnaire saule'!G$18*'Questionnaire saule'!G$23)/(1+('Questionnaire saule'!$G$15-Paramètres!$AF$20))^(B18-1)","v":0},null,0,null,null,null,null,null,8,-393.38074857659581,0]
[null,9,{"$f":"(1+('Questionnaire saule'!$G$15-Paramètres!$AF$20))^(B19-1)","v":1.3685690504052741},0,null,-76.722471525208292,null,-76.722471525208292,null,-470.10322010180408,null,null,{"$f":"('Questionnaire saule'!G$18*'Questionnaire saule'!G$23)/(1+('Questionnaire saule'!$G$15-Paramètres!$AF$20))^(B19-1)","v":0},null,0,null,null,null,null,null,9,-470.10322010180408,0]
[null,10,{"$f":"(1+('Questionnaire saule'!$G$15-Paramètres!$AF$20))^(B20-1)","v":1.4233118124214852},0,null,0,null,0,null,-470.10322010180408,null,null,{"$f":"('Questionnaire saule'!G$18*'Questionnaire saule'!G$23)/(1+('Questionnaire saule'!$G$15-Paramètres!$AF$20))^(B20-1)","v":0},null,0,null,null,null,null,null,10,-470.10322010180408,0]
[null,11,{"$f":"(1+('Questionnaire saule'!$G$15-Paramètres!$AF$20))^(B21-1)","v":1.4802442849183446},0,null,0,null,0,null,-470.10322010180408,null,null,{"$f":"('Questionnaire saule'!G$18*'Questionnaire saule'!G$23)/(1+('Questionnaire saule'!$G$15-Paramètres!$AF$20))^(B21-1)","v":0},null,0,null,null,null,null,null,11,-470.10322010180408,0]
[null,12,{"$f":"(1+('Questionnaire saule'!$G$15-Paramètres!$AF$20))^(B22-1)","v":1.5394540563150783},0,null,-68.205997814143132,null,-68.205997814143132,null,-538.30921791594722,null,null,{"$f":"('Questionnaire saule'!G$18*'Questionnaire saule'!G$23)/(1+('Questionnaire saule'!$G$15-Paramètres!$AF$20))^(B22-1)","v":0},null,0,null,null,null,null,null,12,-538.30921791594722,0]
[null,13,{"$f":"(1+('Questionnaire saule'!$G$15-Paramètres!$AF$20))^(B23-1)","v":1.6010322185676817},0,null,0,null,0,null,-538.30921791594722,null,null,{"$f":"('Questionnaire saule'!G$18*'Questionnaire saule'!G$23)/(1+('Questionnaire saule'!$G$15-Paramètres!$AF$20))^(B23-1)","v":0},null,0,null,null,null,null,null,13,-538.30921791594722,0]
[null,14,{"$f":"(1+('Questionnaire saule'!$G$15-Paramètres!$AF$20))^(B24-1)","v":1.6650735073103891},0,null,0,null,0,null,-538.30921791594722,null,null,{"$f":"('Questionnaire saule'!G$18*'Questionnaire saule'!G$23)/(1+('Questionnaire saule'!$G$15-Paramètres!$AF$20))^(B24-1)","v":0},null,0,null,null,null,null,null,14,-538.30921791594722,0]
[null,15,{"$f":"(1+('Questionnaire saule'!$G$15-Paramètres!$AF$20))^(B25-1)","v":1.7316764476028046},0,null,-60.634883696289606,null,-60.634883696289606,null,-598.94410161223686,null,null,{"$f":"('Questionnaire saule'!G$18*'Questionnaire saule'!G$23)/(1+('Questionnaire saule'!$G$15-Paramètres!$AF$20))^(B25-1)","v":0},null,0,null,null,null,null,null,15,-598.94410161223686,0]
[null,16,{"$f":"(1+('Questionnaire saule'!$G$15-Paramètres!$AF$20))^(B26-1)","v":1.8009435055069167},0,null,0,null,0,null,-598.94410161223686,null,null,{"$f":"('Questionnaire saule'!G$18*'Questionnaire saule'!G$23)/(1+('Questionnaire saule'!$G$15-Paramètres!$AF$20))^(B26-1)","v":0},null,0,null,null,null,null,null,16,-598.94410161223686,0]
[null,17,{"$f":"(1+('Questionnaire saule'!$G$15-Paramètres!$AF$20))^(B27-1)","v":1.8729812457271937},0,null,0,null,0,null,-598.94410161223686,null,null,{"$f":"('Questionnaire saule'!G$18*'Questionnaire saule'!G$23)/(1+('Questionnaire saule'!$G$15-Paramètres!$AF$20))^(B27-1)","v":0},null,0,null,null,null,null,null,17,-598.94410161223686,0]
[null,18,{"$f":"(1+('Questionnaire saule'!$G$15-Paramètres!$AF$20))^(B28-1)","v":1.9479004955562815},0,null,-53.904190814435879,null,-53.904190814435879,null,-652.84829242667274,null,null,{"$f":"('Questionnaire saule'!G$18*'Questionnaire saule'!G$23)/(1+('Questionnaire saule'!$G$15-Paramètres!$AF$20))^(B28-1)","v":0},null,0,null,null,null,null,null,18,-652.84829242667274,0]
[null,19,{"$f":"(1+('Questionnaire saule'!$G$15-Paramètres!$AF$20))^(B29-1)","v":2.025816515378533},0,null,0,null,0,null,-652.84829242667274,null,null,{"$f":"('Questionnaire saule'!G$18*'Questionnaire saule'!G$23)/(1+('Questionnaire saule'!$G$15-Paramètres!$AF$20))^(B29-1)","v":0},null,0,null,null,null,null,null,19,-652.84829242667274,0]
[null,20,{"$f":"(1+('Questionnaire saule'!$G$15-Paramètres!$AF$20))^(B30-1)","v":2.1068491759936743},0,null,0,null,0,null,-652.84829242667274,null,null,{"$f":"('Questionnaire saule'!G$18*'Questionnaire saule'!G$23)/(1+('Questionnaire saule'!$G$15-Paramètres!$AF$20))^(B30-1)","v":0},null,0,null,null,null,null,null,20,-652.84829242667274,0]
[null,21,{"$f":"(1+('Questionnaire saule'!$G$15-Paramètres!$AF$20))^(B31-1)","v":2.1911231430334213},0,null,-47.920629351135666,null,-47.920629351135666,null,-700.76892177780837,null,null,{"$f":"('Questionnaire saule'!G$18*'Questionnaire saule'!G$23)/(1+('Questionnaire saule'!$G$15-Paramètres!$AF$20))^(B31-1)","v":0},null,0,null,null,null,null,null,21,-700.76892177780837,0]
[null,22,{"$f":"(1+('Questionnaire saule'!$G$15-Paramètres!$AF$20))^(B32-1)","v":2.2787680687547587},0,null,0,null,{"$f":"D32+F32","v":0},null,{"$f":"J31+H32","v":-700.76892177780837},null,null,{"$f":"('Questionnaire saule'!G$18*'Questionnaire saule'!G$23)/(1+('Questionnaire saule'!$G$15-Paramètres!$AF$20))^(B32-1)","v":0},null,{"$f":"O31+M32","v":0},null,null,null,null,null,22,{"$f":"J32","v":-700.76892177780837},{"$f":"O32","v":0}]
[null,23,{"$f":"(1+('Questionnaire saule'!$G$15-Paramètres!$AF$20))^(B33-1)","v":2.3699187915049489},{"$f":"SUM(K231:L231)","v":0},null,{"$f":"SUM(F231:J231)","v":0},null,{"$f":"D33+F33","v":0},null,{"$f":"J32+H33","v":-700.76892177780837},null,null,{"$f":"('Questionnaire saule'!G$18*'Questionnaire saule'!G$23)/(1+('Questionnaire saule'!$G$15-Paramètres!$AF$20))^(B33-1)","v":0},null,{"$f":"O32+M33","v":0},null,null,null,null,null,23,{"$f":"J33","v":-700.76892177780837},{"$f":"O33","v":0}]
[null,24,{"$f":"(1+('Questionnaire saule'!$G$15-Paramètres!$AF$20))^(B34-1)","v":2.4647155431651466},{"$f":"SUM(K229:L229)","v":0},null,{"$f":"SUM(F229:J229)","v":-42.60126499837817},null,{"$f":"D34+F34","v":-42.60126499837817},null,{"$f":"J33+H34","v":-743.37018677618653},null,null,{"$f":"('Questionnaire saule'!G$18*'Questionnaire saule'!G$23)/(1+('Questionnaire saule'!$G$15-Paramètres!$AF$20))^(B34-1)","v":0},null,{"$f":"O33+M34","v":0},null,null,null,null,null,24,{"$f":"J34","v":-743.37018677618653},{"$f":"O34","v":0}]
[null,25,{"$f":"(1+('Questionnaire saule'!$G$15-Paramètres!$AF$20))^(B35-1)","v":2.5633041648917527},{"$f":"SUM(K233:L233)","v":0},null,{"$f":"SUM(F233:J233)","v":0},null,{"$f":"D35+F35","v":0},null,{"$f":"J34+H35","v":-743.37018677618653},null,null,{"$f":"('Questionnaire saule'!G$18*'Questionnaire saule'!G$23)/(1+('Questionnaire saule'!$G$15-Paramètres!$AF$20))^(B35-1)","v":0},null,{"$f":"O34+M35","v":0},null,null,null,null,null,25,{"$f":"J35","v":-743.37018677618653},{"$f":"O35","v":0}]
[]
[]
[]
[]
[]
[]
[]
[]
[]
[]
[]
[]
[]
[]
[]
[]
[]
[]
[]
[]
[]
[]
[]
[]
[]
[]
[]
[]
[]
[]
[]
[]
[]
[]
[]
[]
[]
[]
[]
[]
[]
[]
[]
[]
[]
[]
[]
[]
[]
[]
[]
[]
[]
[]
[]
[]
[]
[]
[]
[]
[]
[]
[]
[]
[]
[]
[]
[]
[]
[]
[]
[]
[]
[]
[]
[]
[]
[]
[]
[]
[]
[]
[]
[]
[]
[]
[]
[]
[]
[]
[]
[]
[]
[]
[]
[]
[]
[]
[]
[]
[]
[]
[]
[]
[]
[]
[]
[]
[]
[]
[]
[]
[]
[]
[]
[]
[]
[]
[]
[]
[]
[]
[]
[]
[]
[]
[]
[]
[]
[]
[]
[]
[]
[]
[]
[]
[]
[]
[]
[]
[]
[]
[]
[]
[]
[]
[]
[]
[]
[]
[]
[]
[]
[]
[]
[]
[]
[]
[]
[]
[]
[]
[]
[]
[]
[]
[null,{"$f":"IF(Langue!$A$200 = \"FR\",Dictionnaire!A460,Dictionnaire!B460)","v":"Tableau détaillé de la progression de la marge actualisée cumulative"}]
[null,{"$f":"IF(Langue!$A$200 = \"FR\",Dictionnaire!A461,Dictionnaire!B461)","v":"(en $ d'aujourd'hui)"}]
[]
[null,{"$f":"IF(Langue!$A$200 = \"FR\",Dictionnaire!A462,Dictionnaire!B462)","v":"Année"},"Taux d'actualisation",{"$f":"IF(Langue!$A$200 = \"FR\",Dictionnaire!A464,Dictionnaire!B464)","v":"Marge actualisée de l'année en cours"},{"$f":"IF(Langue!$A$200 = \"FR\",Dictionnaire!A465,Dictionnaire!B465)","v":"Marge actualisée cumulative"},{"$f":"IF(Langue!$A$200 = \"FR\",Dictionnaire!A466,Dictionnaire!B466)","v":"Coûts des boutures"},{"$f":"IF(Langue!$A$200 = \"FR\",Dictionnaire!A467,Dictionnaire!B467)","v":"Coût préparation du sol"},{"$f":"IF(Langue!$A$200 = \"FR\",Dictionnaire!A468,Dictionnaire!B468)","v":"Coût de la plantation"},{"$f":"IF(Langue!$A$200 = \"FR\",Dictionnaire!A469,Dictionnaire!B469)","v":"Coût entretien"},{"$f":"IF(Langue!$A$200 = \"FR\",Dictionnaire!A470,Dictionnaire!B470)","v":"Coût récolte"},{"$f":"IF(Langue!$A$200 = \"FR\",Dictionnaire!A471,Dictionnaire!B471)","v":"Revenus de vente de biomasse"},{"$f":"IF(Langue!$A$200 = \"FR\",Dictionnaire!A472,Dictionnaire!B472)","v":"Revenus liés aux crédits carbones"}]
[null,1,{"$f":"(1+('Questionnaire saule'!$G$15-Paramètres!$AF$20))^(B206-1)","v":1},{"$f":"SUM(F206:L206)","v":-210},{"$f":"D206","v":-210},{"$f":"-'Calculs saule'!D15/C206","v":0},{"$f":"-(SUM('Calculs saule'!D18:D24)/'Bilan des calculs saule'!C206)","v":0},{"$f":"-'Calculs saule'!D26/C206","v":-105},{"$f":"-('Calculs saule'!D31+'Calculs saule'!D33+'Calculs saule'!D34+'Calculs saule'!D35)/C206","v":-105},0,0,{"$f":"'Calculs saule'!$D$41/'Bilan des calculs saule'!C206","v":0}]
[null,2,{"$f":"(1+('Questionnaire saule'!$G$15-Paramètres!$AF$20))^(B207-1)","v":1.04},0,{"$f":"E206+D207","v":-210},0,0,0,{"$f":"-'Calculs saule'!D32/C207","v":0},0,0]
[null,3,{"$f":"(1+('Questionnaire saule'!$G$15-Paramètres!$AF$20))^(B208-1)","v":1.0816000000000001},-97.078402366863898,-307.07840236686388,0,0,0,0,{"$f":"-IF('Questionnaire saule'!$E$57,0,'Calculs saule'!$D$37)/C208","v":-97.078402366863898},{"$f":"IF('Questionnaire saule'!$E$57,0,'Calculs saule'!$D$40)/C208","v":0}]
[null,4,{"$f":"(1+('Questionnaire saule'!$G$15-Paramètres!$AF$20))^(B209-1)","v":1.1248640000000001},0,-307.07840236686388,0,0,0,{"$f":"-IF('Questionnaire saule'!$E$57,0,'Calculs saule'!$D$32)/C209","v":0},{"$f":"-IF('Questionnaire saule'!$E$57,'Calculs saule'!$D$37,0)/C209","v":0},{"$f":"IF('Questionnaire saule'!$E$57,'Calculs saule'!$D$40,0)/C209","v":0}]
[null,5,{"$f":"(1+('Questionnaire saule'!$G$15-Paramètres!$AF$20))^(B210-1)","v":1.1698585600000002},0,-307.07840236686388,0,0,0,{"$f":"-IF('Questionnaire saule'!$E$57,'Calculs saule'!$D$32,0)/C210","v":0},0,0]
[null,6,{"$f":"(1+('Questionnaire saule'!$G$15-Paramètres!$AF$20))^(B211-1)","v":1.2166529024000003},-86.302346209731908,-393.38074857659581,0,0,0,0,{"$f":"-IF('Questionnaire saule'!$E$57,0,'Calculs saule'!$D$37)/C211","v":-86.302346209731908},{"$f":"IF('Questionnaire saule'!$E$57,0,'Calculs saule'!$D$40)/C211","v":0}]
[null,7,{"$f":"(1+('Questionnaire saule'!$G$15-Paramètres!$AF$20))^(B212-1)","v":1.2653190184960004},0,-393.38074857659581,0,0,0,{"$f":"-IF('Questionnaire saule'!$E$57,0,'Calculs saule'!$D$32)/C212","v":0},{"$f":"-IF('Questionnaire saule'!$E$57,'Calculs saule'!$D$37,0)/C212","v":0},{"$f":"IF('Questionnaire saule'!$E$57,'Calculs saule'!$D$40,0)/C212","v":0}]
[null,8,{"$f":"(1+('Questionnaire saule'!$G$15-Paramètres!$AF$20))^(B213-1)","v":1.3159317792358403},0,-393.38074857659581,0,0,0,{"$f":"-IF('Questionnaire saule'!$E$57,'Calculs saule'!$D$32,0)/C213","v":0},0,0]
[null,9,{"$f":"(1+('Questionnaire saule'!$G$15-Paramètres!$AF$20))^(B214-1)","v":1.3685690504052741},-76.722471525208292,-470.10322010180408,0,0,0,0,{"$f":"-IF('Questionnaire saule'!$E$57,0,'Calculs saule'!$D$37)/C214","v":-76.722471525208292},{"$f":"IF('Questionnaire saule'!$E$57,0,'Calculs saule'!$D$40)/C214","v":0}]
[null,10,{"$f":"(1+('Questionnaire saule'!$G$15-Paramètres!$AF$20))^(B215-1)","v":1.4233118124214852},0,-470.10322010180408,0,0,0,{"$f":"-IF('Questionnaire saule'!$E$57,0,'Calculs saule'!$D$32)/C215","v":0},{"$f":"-IF('Questionnaire saule'!$E$57,'Calculs saule'!$D$37,0)/C215","v":0},{"$f":"IF('Questionnaire saule'!$E$57,'Calculs saule'!$D$40,0)/C215","v":0}]
[null,11,{"$f":"(1+('Questionnaire saule'!$G$15-Paramètres!$AF$20))^(B216-1)","v":1.4802442849183446},0,-470.10322010180408,0,0,0,{"$f":"-IF('Questionnaire saule'!$E$57,'Calculs saule'!$D$32,0)/C216","v":0},0,0]
[null,12,{"$f":"(1+('Questionnaire saule'!$G$15-Paramètres!$AF$20))^(B217-1)","v":1.5394540563150783},-68.205997814143132,-538.30921791594722,0,0,0,0,{"$f":"-IF('Questionnaire saule'!$E$57,0,'Calculs saule'!$D$37)/C217","v":-68.205997814143132},{"$f":"IF('Questionnaire saule'!$E$57,0,'Calculs saule'!$D$40)/C217","v":0}]
[null,13,{"$f":"(1+('Questionnaire saule'!$G$15-Paramètres!$AF$20))^(B218-1)","v":1.6010322185676817},0,-538.30921791594722,0,0,0,{"$f":"-IF('Questionnaire saule'!$E$57,0,'Calculs saule'!$D$32)/C218","v":0},{"$f":"-IF('Questionnaire saule'!$E$57,'Calculs saule'!$D$37,0)/C218","v":0},{"$f":"IF('Questionnaire saule'!$E$57,'Calculs saule'!$D$40,0)/C218","v":0}]
[null,14,{"$f":"(1+('Questionnaire saule'!$G$15-Paramètres!$AF$20))^(B219-1)","v":1.6650735073103891},0,-538.30921791594722,0,0,0,{"$f":"-IF('Questionnaire saule'!$E$57,'Calculs saule'!$D$32,0)/C219","v":0},0,0]
[null,15,{"$f":"(1+('Questionnaire saule'!$G$15-Paramètres!$AF$20))^(B220-1)","v":1.7316764476028046},-60.634883696289606,-598.94410161223686,0,0,0,0,{"$f":"-IF('Questionnaire saule'!$E$57,0,'Calculs saule'!$D$37)/C220","v":-60.634883696289606},{"$f":"IF('Questionnaire saule'!$E$57,0,'Calculs saule'!$D$40)/C220","v":0}]
[null,16,{"$f":"(1+('Questionnaire saule'!$G$15-Paramètres!$AF$20))^(B221-1)","v":1.8009435055069167},0,-598.94410161223686,0,0,0,{"$f":"-IF('Questionnaire saule'!$E$57,0,'Calculs saule'!$D$32)/C221","v":0},{"$f":"-IF('Questionnaire saule'!$E$57,'Calculs saule'!$D$37,0)/C221","v":0},{"$f":"IF('Questionnaire saule'!$E$57,'Calculs saule'!$D$40,0)/C221","v":0}]
[null,17,{"$f":"(1+('Questionnaire saule'!$G$15-Paramètres!$AF$20))^(B222-1)","v":1.8729812457271937},0,-598.94410161223686,0,0,0,{"$f":"-IF('Questionnaire saule'!$E$57,'Calculs saule'!$D$32,0)/C222","v":0},0,0]
[null,18,{"$f":"(1+('Questionnaire saule'!$G$15-Paramètres!$AF$20))^(B223-1)","v":1.9479004955562815},-53.904190814435879,-652.84829242667274,0,0,0,0,{"$f":"-IF('Questionnaire saule'!$E$57,0,'Calculs saule'!$D$37)/C223","v":-53.904190814435879},{"$f":"IF('Questionnaire saule'!$E$57,0,'Calculs saule'!$D$40)/C223","v":0}]
[null,19,{"$f":"(1+('Questionnaire saule'!$G$15-Paramètres!$AF$20))^(B224-1)","v":2.025816515378533},0,-652.84829242667274,0,0,0,{"$f":"-IF('Questionnaire saule'!$E$57,0,'Calculs saule'!$D$32)/C224","v":0},{"$f":"-IF('Questionnaire saule'!$E$57,'Calculs saule'!$D$37,0)/C224","v":0},{"$f":"IF('Questionnaire saule'!$E$57,'Calculs saule'!$D$40,0)/C224","v":0}]
[null,20,{"$f":"(1+('Questionnaire saule'!$G$15-Paramètres!$AF$20))^(B225-1)","v":2.1068491759936743},0,-652.84829242667274,0,0,0,{"$f":"-IF('Questionnaire saule'!$E$57,'Calculs saule'!$D$32,0)/C225","v":0},0,0]
[null,21,{"$f":"(1+('Questionnaire saule'!$G$15-Paramètres!$AF$20))^(B226-1)","v":2.1911231430334213},{"$f":"SUM(F226:L226)","v":-47.920629351135666},{"$f":"E225+D226","v":-700.76892177780837},0,0,0,0,{"$f":"-IF('Questionnaire saule'!$E$57,0,'Calculs saule'!$D$37)/C226","v":-47.920629351135666},{"$f":"IF('Questionnaire saule'!$E$57,0,'Calculs saule'!$D$40)/C226","v":0}]
[null,22,{"$f":"(1+('Questionnaire saule'!$G$15-Paramètres!$AF$20))^(B227-1)","v":2.2787680687547587},{"$f":"SUM(F227:L227)","v":0},{"$f":"E226+D227","v":-700.76892177780837},0,0,0,0,{"$f":"-IF('Questionnaire saule'!$E$57,'Calculs saule'!$D$37,0)/C227","v":0},{"$f":"IF('Questionnaire saule'!$E$57,'Calculs saule'!$D$40,0)/C227","v":0}]
[null,23,{"$f":"(1+('Questionnaire saule'!$G$15-Paramètres!$AF$20))^(B228-1)","v":2.3699187915049489},{"$f":"SUM(F228:L228)","v":0},{"$f":"E227+D228","v":-700.76892177780837},0,0,0,0,{"$f":"-IF('Questionnaire saule'!$E$57,'Calculs saule'!$D$37,0)/C228","v":0},{"$f":"IF('Questionnaire saule'!$E$57,'Calculs saule'!$D$40,0)/C228","v":0}]
[null,24,{"$f":"(1+('Questionnaire saule'!$G$15-Paramètres!$AF$20))^(B229-1)","v":2.4647155431651466},{"$f":"SUM(F229:L229)","v":-42.60126499837817},{"$f":"E228+D229","v":-743.37018677618653},0,0,0,0,{"$f":"-IF('Questionnaire saule'!$E$57,0,'Calculs saule'!$D$37)/C229","v":-42.60126499837817},{"$f":"IF('Questionnaire saule'!$E$57,0,'Calculs saule'!$D$40)/C229","v":0}]
[null,25,{"$f":"(1+('Questionnaire saule'!$G$15-Paramètres!$AF$20))^(B230-1)","v":2.5633041648917527},{"$f":"SUM(F230:L230)","v":0},{"$f":"E229+D230","v":-743.37018677618653},0,0,0,0,{"$f":"-IF('Questionnaire saule'!$E$57,'Calculs saule'!$D$37,0)/C230","v":0},{"$f":"IF('Questionnaire saule'!$E$57,'Calculs saule'!$D$40,0)/C230","v":0}]
[]
[]
[]
[]
[]
[]
[]
[]
[]
[]
[]
[]
[]
[]
[]
[]
[]
[]
[]
[]
[]
[]
[]
[]
[]
[]
[]
[]
[]
[]
[]
[]
[]
[]
[]
[]
[]
[]
[]
[]
[]
[]
[]
[]
[]
[]
[]
[]
[]
[]
[]
[]
[]
[]
[]
[]
[]
[]
[]
[]
[]
[]
[]
[]
[]
[]
[]
[]
[]
[]
[]
[]
[]
[]
[]
[null,{"$f":"IF(Langue!$A$200 = \"FR\",Dictionnaire!A474,Dictionnaire!B474)","v":"Tableau en $ / tonne"}]
[null,{"$f":"IF(Langue!$A$200 = \"FR\",Dictionnaire!A475,Dictionnaire!B475)","v":"(en $ d'aujourd'hui)"}]
[]
[null,"Rotation","Taux d'actualisation",{"$f":"IF(Langue!$A$200 = \"FR\",Dictionnaire!A476,Dictionnaire!B476)","v":"Revenus actualisés"},null,{"$f":"IF(Langue!$A$200 = \"FR\",Dictionnaire!A477,Dictionnaire!B477)","v":"Dépenses actualisées"},null,{"$f":"IF(Langue!$A$200 = \"FR\",Dictionnaire!A478,Dictionnaire!B478)","v":"Marge actualisée"},null,{"$f":"IF(Langue!$A$200 = \"FR\",Dictionnaire!A479,Dictionnaire!B479)","v":"Marge actualisée cumulative"}]
[]
[null,1,{"$f":"(1+('Questionnaire saule'!$G$15-Paramètres!$AF$20))^(B311-1)","v":1},{"$f":"IF('Questionnaire saule'!$E$57,SUM(D11:E14),SUM(D11:E13))/'Calculs saule'!B44","v":{"$error":"#DIV/0!"}},null,{"$f":"IF('Questionnaire saule'!$E$57,SUM(F11:G14),SUM(F11:G13))/'Calculs saule'!B44","v":{"$error":"#DIV/0!"}},null,{"$f":"D311+F311","v":{"$error":"#DIV/0!"}},null,{"$f":"H311","v":{"$error":"#DIV/0!"}}]
[null,2,{"$f":"(1+('Questionnaire saule'!$G$15-Paramètres!$AF$20))^(B312-1)","v":1.04},{"$f":"IF('Questionnaire saule'!$E$57,SUM(D15:E17),SUM(D14:E16))/'Calculs saule'!B44","v":{"$error":"#DIV/0!"}},null,{"$f":"IF('Questionnaire saule'!$E$57,SUM(F15:G17),SUM(F14:G16))/'Calculs saule'!B44","v":{"$error":"#DIV/0!"}},null,{"$f":"D312+F312","v":{"$error":"#DIV/0!"}},null,{"$f":"J311+H312","v":{"$error":"#DIV/0!"}}]
[null,3,{"$f":"(1+('Questionnaire saule'!$G$15-Paramètres!$AF$20))^(B313-1)","v":1.0816000000000001},{"$f":"IF('Questionnaire saule'!$E$57,SUM(D18:E20),SUM(D17:E19))/'Calculs saule'!B44","v":{"$error":"#DIV/0!"}},null,{"$f":"IF('Questionnaire saule'!$E$57,SUM(F18:G20),SUM(F17:G19))/'Calculs saule'!B44","v":{"$error":"#DIV/0!"}},null,{"$error":"#DIV/0!"},null,{"$error":"#DIV/0!"}]
[null,4,{"$f":"(1+('Questionnaire saule'!$G$15-Paramètres!$AF$20))^(B314-1)","v":1.1248640000000001},{"$f":"IF('Questionnaire saule'!$E$57,SUM(D21:E23),SUM(D20:E22))/'Calculs saule'!B44","v":{"$error":"#DIV/0!"}},null,{"$f":"IF('Questionnaire saule'!$E$57,SUM(F21:G23),SUM(F20:G22))/'Calculs saule'!B44","v":{"$error":"#DIV/0!"}},null,{"$error":"#DIV/0!"},null,{"$error":"#DIV/0!"}]
[null,5,{"$f":"(1+('Questionnaire saule'!$G$15-Paramètres!$AF$20))^(B315-1)","v":1.1698585600000002},{"$f":"IF('Questionnaire saule'!$E$57,SUM(D24:E26),SUM(D23:E25))/'Calculs saule'!B44","v":{"$error":"#DIV/0!"}},null,{"$f":"IF('Questionnaire saule'!$E$57,SUM(F24:G26),SUM(F23:G25))/'Calculs saule'!B44","v":{"$error":"#DIV/0!"}},null,{"$error":"#DIV/0!"},null,{"$error":"#DIV/0!"}]
[null,6,{"$f":"(1+('Questionnaire saule'!$G$15-Paramètres!$AF$20))^(B316-1)","v":1.2166529024000003},{"$f":"IF('Questionnaire saule'!$E$57,SUM(D27:E29),SUM(D26:E28))/'Calculs saule'!B44","v":{"$error":"#DIV/0!"}},null,{"$f":"IF('Questionnaire saule'!$E$57,SUM(F27:G29),SUM(F26:G28))/'Calculs saule'!B44","v":{"$error":"#DIV/0!"}},null,{"$error":"#DIV/0!"},null,{"$error":"#DIV/0!"}]
[null,7,{"$f":"(1+('Questionnaire saule'!$G$15-Paramètres!$AF$20))^(B317-1)","v":1.2653190184960004},{"$f":"IF('Questionnaire saule'!$E$57,SUM(D30:E34),SUM(D29:E31))/'Calculs saule'!B44","v":{"$error":"#DIV/0!"}},null,{"$f":"IF('Questionnaire saule'!$E$57,SUM(F30:G34),SUM(F29:G31))/'Calculs saule'!B44","v":{"$error":"#DIV/0!"}},null,{"$error":"#DIV/0!"},null,{"$error":"#DIV/0!"}]